{"text_format":"1","workbook":"xlsx","n_sheets":36,"sheets":["CARATULA","Indice Tablero","Resumen","Indicadores","Datos","Acciones","SemblanzaF","Practicas","PobAtendida","Produccion","Tomas y coberturas","Tratamiento","Facturacion","EElectrica","Sercontinuo","Medescompuestos","Deudxservicio","Empleados","Costos","BalanceG","NoPerceptible","PerdidasTanque","Inversiones","Parametros","Indice Evaluacion","Datos basicos","Acciones a Ejecutar","Premisas Beneficios","Premisas Inversiones","Premisas OPEX","Detalle evaluacion","Evaluacion","Calendarizacion","Parametros Evaluacion","Proyecciones Base","Precios"],"not_rendered":{"charts":0,"images":0,"macros":1,"external_links":0,"defined_names":13,"comments":3,"pivot_tables":0},"unopened":[],"bounds":{"document_bytes":16777216,"sheet_cells":100000,"rows_first":2000,"rows_last":500,"rows_between":2000,"halvings":0,"cell_chars":16384,"cell_head_chars":4096},"cells_cut":0,"cells_raw":0,"read":"whole","date_system":"1900"}

{"sheet":"CARATULA","index":0,"n_rows":50,"n_cols":7,"rows_kept":50,"cut":false,"hidden":false,"merged":[[9,2,9,3],[10,2,10,3],[11,2,11,3],[13,3,13,5],[22,1,22,3],[12,1,12,2],[8,2,8,3],[3,3,3,5],[4,3,4,5],[5,3,5,5],[6,2,6,5],[7,2,7,3],[3,1,3,2],[4,1,4,2],[5,1,5,2],[13,1,13,2],[14,1,14,2],[20,5,25,5],[20,1,20,4],[27,5,32,5]]}
[null,{"$f":"+MID(B50,F50+1,G50-F50-1)","v":"Tablero y evaluacion v41.xlsm"}]
[]
[null,"CARATULA",null,null,{"$f":"+TODAY()","v":"2021-08-19"},"Versión 41"]
[null,"1. NOMBRE OFICIAL DEL ORGANISMO OPERADOR",null,"X"]
[null,"2. SIGLA DEL ORGANISMO OPERADOR",null,"X"]
[null,"3. R.F.C.: ",null,"X"]
[null,"4. DOMICILIO"]
[null,"a) CALLE Y NUMERO","X",null,"b) COLONIA"]
[null,"c) LOCALIDAD",null,null,"d) MUNICIPIO"]
[null,"e) ESTADO",null,null,"f) CODIGO POSTAL"]
[null,"5. TELEFONO","X",null,"6. FAX:"]
[null,"7. PAGINA WEB",null,null,"8.CORREO ELECTRONICO GENERAL"]
[null,"9. DIRECTOR O RESPONSABLE",null,null,"10. CARGO"]
[null,"11. RESPONSABLE POR LA ENTREGA DE LOS DATOS",null,"X"]
[null,"12. CORREO ELECTRONICO",null,"X","13.TELEFONO"]
[]
[]
[]
[]
[]
[null,null,null,null,null,"El boton \"Importar Datos\" importa los datos de una versión diferente,  y los convierte en Version 41. El libro de donde se extraen los datos debe llamarse \"Archivo Entrada.xlsm\" y debe estar abierto."]
[]
[]
[]
[]
[]
[]
[null,null,null,null,null,"Verificar que todas las hojas del \"Archivo Entrada.xlsm\",  se encuentren sin acentos graficos o tildes."]
[]
[]
[]
[]
[]
[null,null,null,null,null,"Este archivo de extraccion no corre en sistema MAC, solo en PC Windows"]
[null,null,null,null,null,"Una vez realizada la extraccion, guardar el archivo con otro nombre"]
[]
[]
[]
[]
[]
[]
[]
[]
[]
[]
[]
[]
[]
[]
[null,{"$f":"IFERROR(CELL(\"nombrearchivo\"), CELL(\"filename\"))","v":"Macintosh HD:Users:arturomartinez:Downloads:[Tablero y evaluacion v41.xlsm]Parametros"},null,null,null,{"$f":"+SEARCH(\"[\",B50)","v":45},{"$f":"+SEARCH(\"]\",B50)","v":75}]

{"sheet":"Indice Tablero","index":1,"n_rows":29,"n_cols":3,"rows_kept":29,"cut":false,"hidden":false,"merged":[[1,1,1,2],[28,1,28,2]]}
[]
[null,"INDICE TABLERO DE INFORMACIÓN"]
[null,"CONTENIDO","HOJA"]
[null,"                      RESUMEN","Resumen"]
[null,"Formato 1.      RESUMEN DE INDICADORES DE GESTION","Indicadores"]
[null,"Formato 2.      DATOS NECESARIOS PARA DETERMINAR INDICADORES DE GESTIÓN","Datos"]
[null,"Formato 3.      ACCIONES A REALIZAR SEGÚN SEMÁFORO","Acciones"]
[null,"Formato 4.      SEMBLANZA FINANCIERA","SemblnzaF"]
[null,"Formato 5.      PRACTICAS DE GESTION","Prácticas"]
[null,"Formato 6.      POBLACION ATENDIDA","PobAtendida"]
[null,"Formato 7.      PRODUCCION POR FUENTE","Producción"]
[null,"Formato 8.a.      REGISTRO DE TOMAS Y CONEXIONES","Tomas y coberturas"]
[null,"Formato 8.b.      DATOS PARA CÁLCULO DE COBERTURAS","Tomas y coberturas"]
[null,"Formato 9.a.   TRATAMIENTO DE AGUAS RESIDUALES","Tratamiento"]
[null,"Formato 9.b.   PLANTAS POTABILIZADORAS","Tratamiento"]
[null,"Formato 10.a. FACTURACIÓN DE AGUA POTABLE, ALCANTARILLADO Y SANEAMIENTO","Facturación"]
[null,"Formato 10.b. INGRESOS (Facturación de APAS y otros servicios)","Facturación"]
[null,"Formato 11.    ANÁLISIS DEL GASTO DE ENERGÍA ELÉCTRICA","Eelectrica"]
[null,"Formato 12.    CONTINUIDAD EN EL SERVICIO","Sercontinuo"]
[null,"Formato 13.    REPORTE DE MEDIDORES DESCOMPUESTOS","Medescompuestos"]
[null,"Formato 14.    DEUDORES POR SERVICIO","Deudxservicio"]
[null,"Formato 15.    PERSONAL","Empleados"]
[null,"Formato 16.    EGRESOS (GASTOS)","Costos"]
[null,"Formato 17.    BALANCE GENERAL","BalanceG"]
[null,"Formato 18.    DETERMINACION DE LAS FUGAS NO VISIBLES","NoPerceptible"]
[null,"Formato 19.    DETERMINACION DE LAS FUGAS EN TANQUES","PerdidasTanque"]
[null,"Formato 20.    OTRAS INVERSIONES REQUERIDAS","Inversiones"]
[null,"Formato 21.   PARAMETROS DE SEMAFORIZACION","Parámetros"]
[null,"NOTA : Si necesita insertar una fila dentro de alguna planilla hágalo en una fila al centro de ella"]

{"sheet":"Resumen","index":2,"n_rows":27,"n_cols":10,"rows_kept":27,"cut":false,"hidden":false,"merged":[[26,1,36,1],[3,2,3,3],[4,2,4,3],[23,2,23,3],[24,2,24,3],[25,2,25,3],[26,2,36,9],[1,1,1,2],[19,7,19,8],[20,7,20,8],[21,7,21,8],[22,7,22,8],[19,2,19,3],[20,2,20,3],[21,2,21,3],[22,2,22,3],[7,4,7,6]]}
[]
[null,"Formato RESUMEN "]
[]
[null,"NOMBRE:",{"$f":"+Datos!C4","v":"X"}]
[null,"AÑO:",{"$f":"+Datos!C5","v":0}]
[]
[]
[null,null,null,null,"MARGEN OPERACIONAL:",null,null,{"$f":"+Indicadores!D99","v":0}]
[]
[]
[]
[null,null,null,"INGRESOS",{"$f":"+Datos!E54+Datos!E58+Datos!E59+Datos!E60","v":0},null,null,"EGRESOS",{"$f":"-Indicadores!D96-Datos!E43-Indicadores!D97","v":0}]
[]
[]
[]
[]
[]
[]
[]
[null,null,"Eficiencia Comercial",null,{"$f":"+Indicadores!D38","v":0},null,null,"Eficiencia Física",null,{"$f":"+Indicadores!D64","v":0}]
[null,null,"Tarifa Media",null,{"$f":"+Indicadores!D44","v":0},null,null,"Indice de Personal /1000 tomas",null,{"$f":"+Indicadores!D28","v":0}]
[null,null,"% de Medición efectiva",null,{"$f":"+Indicadores!D41","v":0},null,null,"%Gastos de personal",null,{"$f":"+Indicadores!D33","v":0}]
[null,null,"% Medidores a cambiar",null,{"$f":"+Indicadores!D54","v":0},null,null,"%Gastos EE",null,{"$f":"+Indicadores!D18","v":0}]
[]
[]
[]
[null,"Breve descripción de la situación del Organismo Operador:"]

{"sheet":"Indicadores","index":3,"n_rows":118,"n_cols":8,"rows_kept":118,"cut":false,"hidden":false,"merged":[[62,7,73,10],[94,7,113,10],[117,2,127,5],[93,1,93,5],[76,1,76,5],[25,1,25,5],[35,1,35,5],[61,1,61,5],[26,7,33,10],[36,7,59,10],[7,7,13,10],[16,7,23,10],[1,1,1,2],[3,2,3,4],[4,2,4,4],[6,1,6,5],[15,1,15,5]]}
[]
[null,"Formato 1. RESUMEN DE INDICADORES DE GESTION"]
[]
[null,"NOMBRE:",{"$f":"+Datos!C4","v":"X"}]
[null,"AÑO:",{"$f":"+Datos!C5","v":0}]
[]
[null,"MÓDULO DE COBERTURAS",null,null,null,null,null,"Ingrese Areas de mejora:"]
[null,"Número","Indicador","Resultado","Referencia","Meta"]
[null,1,"Cobertura de agua potable",{"$f":"IFERROR(Datos!E$10/Datos!E$9,0)","v":0}]
[null,{"$f":"1+B9","v":2},"Cobertura de alcantarillado",{"$f":"IFERROR(Datos!E28/(Datos!E12/D9),0)","v":0}]
[null,{"$f":"1+B10","v":3},"Cobertura de tratamiento",{"$f":"IFERROR(MIN(D10,Tratamiento!E47/(Facturacion!E14*0.8/(1-(1-D64)*Datos!E75))),0)","v":0}]
[null,{"$f":"1+B11","v":4},"Eficiencia global",{"$f":"+D38*D64","v":0}]
[null,{"$f":"1+B12","v":5},"Capacidad instalada de tratamiento  de aguas residuales (lps)",{"$f":"Tratamiento!E46","v":0}]
[null,{"$f":"1+B13","v":6},"% de Cumplimiento de calidad bacteriológica de agua potable",{"$f":"+IFERROR(Datos!E68/Datos!E67,0)","v":0}]
[null,null,null,null,null,null," "]
[null,"MÓDULO DE EFICIENCIA ENERGÉTICA",null,null,null,null,null,"Ingrese Areas de mejora:"]
[null,"Número","Indicador","Resultado","Referencia","Meta"]
[null,{"$f":"+B14+1","v":7},"Incidencia de la energía eléctrica",{"$f":"IFERROR(Datos!E44/Datos!E43,0)","v":0}]
[null,{"$f":"+B18+1","v":8},"Gasto unitario de la energía eléctrica ($/kWh)",{"$f":"IFERROR(Datos!E44/(12*EElectrica!J158),0)","v":0}]
[null,9,"Gasto de EE por metro cúbico producido ($/m3)  (No considera Agua en bloque)",{"$f":"IFERROR(Datos!E44/(Produccion!P159-Produccion!P160),0)","v":0}]
[null,10,"Indicador energético (kWh/m3 producido) (No considera Agua en bloque)",{"$f":"IFERROR(EElectrica!J158*12/(Produccion!P159-Produccion!P160),0)","v":0}]
[null,11,{"$f":"EElectrica!C169","v":"Porcentaje de Consumo en Punta (promedio)"},{"$f":"EElectrica!J169","v":0}]
[null,12,"Factor de Carga",{"$f":"EElectrica!S158","v":0}]
[null,13,"Factor de Potencia",{"$f":"EElectrica!R158","v":0}]
[]
[null,"MÓDULO DE ADMINISTRACIÓN Y MANEJO DE PERSONAL",null,null,null,null,null,"Ingrese Areas de mejora:"]
[null,"Número","Indicador","Resultado","Referencia","Meta"]
[null,{"$f":"+B24+1","v":14},"Indice laboral (empleados /1000 tomas)",{"$f":"IFERROR(Datos!E51/(Datos!E12/1000),0)","v":0}]
[null,{"$f":"1+B28","v":15},"Sueldo mensual promedio por empleado ($/empleado/mes)",{"$f":"IFERROR(D32/Datos!E51/12,0)","v":0}]
[null,16,"Recaudación mensual promedio por empleado ($/empleado/mes)",{"$f":"IFERROR(Datos!E54/Datos!E51/12,0)","v":0}]
[null,17,"Proporción de personal operativo",{"$f":"IFERROR(Empleados!C19/Empleados!C22,0)","v":0}]
[null,18,"Gastos en remuneraciones (sueldos, salarios y prestaciones)",{"$f":"+Datos!E45","v":0}]
[null,19,"Proporción de gastos en remuneraciones respecto al gastos operacionales",{"$f":"IFERROR(Datos!E45/Datos!E43,0)","v":0}]
[null,20,"El consejo de administración y/o el directorio del organismo tienen \"autonomía empresarial\" en temas relacionados con la fijación de remuneraciones y dotación de personal",{"$f":"+Practicas!C10","v":0}]
[]
[null,"MÓDULO DE GESTIÓN COMERCIAL",null,null,null,null,null,"Ingrese Areas de mejora:"]
[null,"Número","Indicador","Resultado","Referencia","Meta"]
[null,{"$f":"+B34+1","v":21},"Eficiencia comercial",{"$f":"IFERROR(Datos!E54/Datos!E53,0)","v":0}]
[null,{"$f":"+B38+1","v":22},"Cobertura de micromedición instalada",{"$f":"IFERROR('Tomas y coberturas'!D15/'Tomas y coberturas'!C15,0)","v":0}]
[null,{"$f":"+B39+1","v":23},"Cobertura de volumen micromedido",{"$f":"IFERROR(Facturacion!C14/Facturacion!E14,0)","v":0}]
[null,24,"Cobertura de micromedición con lectura ",{"$f":"IFERROR('Tomas y coberturas'!E15/'Tomas y coberturas'!C15,0)","v":0}]
[null,25,"Recaudación anual por toma ($/toma/año)",{"$f":"IFERROR(Datos!E54/Datos!E12,0)","v":0}]
[null,26,"Facturación anual por toma ($/toma/año) INTEGRADA",{"$f":"IFERROR(Datos!E53/Datos!E12,0)","v":0}]
[null,27,"Tarifa media facturada ($/m3)  INTEGRADA",{"$f":"IFERROR((Datos!E55+Datos!E56+Datos!E57)/Datos!E35,0)","v":0}]
[null,28,"Tarifa media facturada domésticos ($/m3) INTEGRADA",{"$f":"IFERROR((Facturacion!I9+Facturacion!K9+Facturacion!L9)/Facturacion!E9,0)","v":0}]
[null,29,"Tarifa media facturada comercios e industrias ($/m3) INTEGRADA",{"$f":"IFERROR((Facturacion!I10+Facturacion!K10+Facturacion!L10+Facturacion!I11+Facturacion!K11+Facturacion!L11)/(Facturacion!C10+Facturacion!C11),0)","v":0}]
[null,30,"Tarifa media cobrada ($/m3) INTEGRADA",{"$f":"IFERROR(Datos!E54/Datos!E35,0)","v":0}]
[null,31,"Facturación anual por toma  servicio medido ($/toma/año) INTEGRADA",{"$f":"IFERROR(Facturacion!G14/('Tomas y coberturas'!D15),D49)*(1+IFERROR((Facturacion!K14+Facturacion!L14)/Facturacion!I14,0))","v":0}]
[null,32,"Facturación anual por toma cuota fija ($/toma/año) INTEGRADA",{"$f":"IFERROR(Facturacion!H14/('Tomas y coberturas'!G15),0)*(1+IFERROR((Facturacion!K14+Facturacion!L14)/Facturacion!I14,0))","v":0}]
[null,33,"% Volumen de agua facturada con micromedición",{"$f":"IFERROR(Facturacion!C14/Datos!E35,0)","v":0}]
[null,34,"Volumen de agua facturada con cuota fija",{"$f":"IFERROR(Facturacion!D14/Datos!E35,0)","v":0}]
[null,35,"Consumo medio (m3/toma/mes)",{"$f":"+Datos!E37","v":0}]
[null,36,"Tomas activas sin micromedidor leido",{"$f":"'Tomas y coberturas'!F15+'Tomas y coberturas'!G15","v":0}]
[null,37,"% Medidores con mas de 5 años de antigüedad",{"$f":"IFERROR((Datos!E25+Datos!E26)/'Tomas y coberturas'!D15,0)","v":0}]
[null,38,"% Medidores con mas de 10 años de antigüedad",{"$f":"IFERROR(Datos!E26/'Tomas y coberturas'!D15,0)","v":0}]
[null,39,"% de pérdidas comerciales sobre pérdidas totales",{"$f":"+Datos!E75","v":0}]
[null,40,"Potencial de cobranza en agua suministrada (agua suministrada no facturada)",{"$f":"+D56*(Datos!E29-Datos!E35)*D44","v":0}]
[null,41,"Potencial de cobranza en lo facturado (por agua facturada no cobrada)",{"$f":"+Datos!E53-Datos!E54","v":0}]
[null,42,"El consejo de administración y/o el directorio del organismo tienen \"autonomía empresarial\" para fijar las tarifas por los servicios que presta el OO",{"$f":"+Practicas!C11","v":0}]
[null,43,"Las tarifas por los servicios que presta el OO son actualizadas anualmente (por medio de indexación o algún proceso de revisión continua)",{"$f":"+Practicas!C12","v":0}]
[]
[null,"MÓDULO DE EFICIENCIA FÍSICA",null,null,null,null,null,"Ingrese Areas de mejora:"]
[null,"Número","Indicador","Resultado","Referencia","Meta"]
[null,{"$f":"+B60+1","v":44},"Eficiencia física",{"$f":"IFERROR(Datos!E35/Datos!E29,0)","v":0}]
[null,{"$f":"+B64+1","v":45},"Continuidad en el servicio",{"$f":"+Sercontinuo!H60","v":0}]
[null,46,"% de tomas con servicio continuo",{"$f":"+IFERROR(Sercontinuo!D59/Sercontinuo!C59,0)","v":0}]
[null,47,"Dotación a nivel de producción por habitante (l/hab/dia)",{"$f":"IFERROR(Datos!E29*1000/Datos!E10/365,0)","v":0}]
[null,48,"Consumo por habitante (l/hab/dia)",{"$f":"IFERROR((Datos!E35/Datos!E$10)*1000/365,0)","v":0}]
[null,49,"% Agua no contabilizada",{"$f":"1-D64","v":1}]
[null,50,"Tiempo promedio de servicio (horas diarias)",{"$f":"+D65*24","v":0}]
[null,51,"Cobertura de volumen macromedido",{"$f":"IFERROR(Datos!E34/Datos!E29,0)","v":0}]
[null,52,"Relación de Agua residual tratada respecto a agua potable facturada",{"$f":"IFERROR(Datos!E36/Datos!E35,0)","v":0}]
[null,53,"Pérdidas físicas no perceptibles en la red y tomas",{"$f":"Datos!E73+Datos!E74","v":0}]
[null,54,"Pérdidas físicas en tanques",{"$f":"PerdidasTanque!F70","v":0}]
[null,55,"Longitud de la red (Kms)",{"$f":"+NoPerceptible!H66","v":0}]
[]
[null,"MÓDULO FINANCIERO"]
[null,"Número","Indicador","Resultado","Referencia","Meta"]
[null,{"$f":"+B75+1","v":56},"Margen operativo ($)",{"$f":"Datos!E54+SUM(Datos!E58:E60)-Datos!E43","v":0}]
[null,{"$f":"+B79+1","v":57},"Margen Operativo sobre Ingresos (Cobranza) (%)",{"$f":"IFERROR(D79/Datos!E54,0)","v":0}]
[null,{"$f":"+B80+1","v":58},"Costo unitario de operación por metro cúbico producido ($/m3)",{"$f":"IFERROR(Datos!E43/Datos!E29,0)","v":0}]
[null,{"$f":"+B81+1","v":59},"Costo unitario de operación por metro cúbico facturado ($/m3)",{"$f":"IFERROR(Datos!E43/Datos!E35,0)","v":0}]
[null,60,"Costo total promedio mensual por toma ($/toma/mes)",{"$f":"IFERROR(Datos!E43/Datos!E12/12,0)","v":0}]
[null,61,"Liquidez",{"$f":"IFERROR(BalanceG!D19/BalanceG!I19,0)","v":0}]
[null,62,"Prueba del ácido",{"$f":"IFERROR((BalanceG!D19-BalanceG!C18)/BalanceG!I19,0)","v":0}]
[null,63,"Capital de Trabajo",{"$f":"+BalanceG!D19-BalanceG!I19","v":0}]
[null,64,"Indice de endeudamiento",{"$f":"IFERROR(BalanceG!I25/BalanceG!D36,0)","v":0}]
[null,65,"Apalancamiento",{"$f":"IFERROR(BalanceG!D36/BalanceG!I34,0)","v":0}]
[null,66,"Rentabilidad",{"$f":"IFERROR((Datos!E54+SUM(Datos!E58:E60)-Datos!E43)/BalanceG!I34,0)","v":0}]
[null,67,"Productividad",{"$f":"IFERROR((Datos!E54+SUM(Datos!E58:E60)-Datos!E43)/BalanceG!D36,0)","v":0}]
[null,68,"Infraestructura por usuario",{"$f":"IFERROR(BalanceG!D27/Datos!E12,0)","v":0}]
[null,69,"Relación de operación",{"$f":"IFERROR((Datos!E54+SUM(Datos!E58:E60))/Datos!E43,0)","v":0}]
[]
[null,"MÓDULO FINANCIERO CORREGIDO",null,null,null,null,null,"Ingrese Areas de mejora:"]
[null,"Número","Indicador","Resultado","Referencia","Meta"]
[null,{"$f":"+B92+1","v":70},"Reposición anual",{"$f":"+Datos!E69*Datos!E70*Datos!E12","v":0}]
[null,{"$f":"+B96+1","v":71},"Inversión por crecimiento",{"$f":"+Datos!E71*Datos!E12*Datos!E70*Datos!E72","v":0}]
[null,{"$f":"+B97+1","v":72},"Descuento de cuentas por cobrar del activo circulante",{"$f":"+Datos!E64","v":0}]
[null,{"$f":"+B98+1","v":73},"Margen operativo ($)",{"$f":"Datos!E54+Datos!E58+Datos!E59+Datos!E60-Datos!E43-D96-D97","v":0}]
[null,{"$f":"+B99+1","v":74},"Margen Operativo sobre Ingresos (Cobranza) (%)",{"$f":"IFERROR(D99/Datos!E54,0)","v":0}]
[null,75,"Gasto unitario de operación por metro cúbico producido ($/m3)",{"$f":"IFERROR((Datos!E43+D96+D97)/Datos!E29,0)","v":0}]
[null,76,"Gasto unitario de operación por metro cúbico facturado ($/m3)",{"$f":"IFERROR((Datos!E43+D96+D97)/Datos!E35,0)","v":0}]
[null,77,"Gasto total promedio mensual por toma ($/toma/mes)",{"$f":"IFERROR((Datos!E43+D96+D97)/Datos!E12/12,0)","v":0}]
[null,78,"Liquidez",{"$f":"IFERROR((BalanceG!D19-D98)/BalanceG!I19,0)","v":0}]
[null,79,"Prueba del ácido",{"$f":"IFERROR((BalanceG!D19-BalanceG!C18-D98)/BalanceG!I19,0)","v":0}]
[null,80,"Capital de Trabajo",{"$f":"+BalanceG!D19-BalanceG!I19-D98","v":0}]
[null,81,"Indice de endeudamiento",{"$f":"IFERROR(BalanceG!I25/(BalanceG!D36-D98),0)","v":0}]
[null,82,"Apalancamiento",{"$f":"IFERROR((BalanceG!D36-D98)/BalanceG!I34,0)","v":0}]
[null,83,"Rentabilidad",{"$f":"IFERROR((Datos!E54+Datos!E58-Datos!E43-D96-D97)/BalanceG!I34,0)","v":0}]
[null,84,"Productividad",{"$f":"IFERROR((Datos!E54+Datos!E58-Datos!E43-D96-D97)/(BalanceG!D36-D98),0)","v":0}]
[null,85,"Infraestructura por usuario (a 20 años)",{"$f":"IFERROR((BalanceG!D27+(D96+D97)*20)/Datos!E12,0)","v":0}]
[null,86,"Relación de operación",{"$f":"IFERROR((Datos!E54+Datos!E58)/(Datos!E43+D96+D97),0)","v":0}]
[null,87,"Requerimiento de Financiamiento",{"$f":"+MAX(SemblanzaF!C61:H61)","v":0}]
[null,88,"% de Financiamiento requerido sobre ingresos",{"$f":"IFERROR(D113/(Datos!E54+Datos!E58+Datos!E59+Datos!E60),0)","v":0}]
[]
[]
[]
[null,"Notas:"]

{"sheet":"Datos","index":4,"n_rows":79,"n_cols":9,"rows_kept":79,"cut":false,"hidden":false,"merged":[[6,1,6,4],[1,1,1,3],[3,2,3,6],[4,4,4,6],[78,2,88,6]]}
[]
[null,"Formato 2. DATOS NECESARIOS PARA DETERMINAR INDICADORES DE GESTIÓN"]
[]
[null,"NOMBRE:",{"$f":"+CARATULA!D4","v":"X"}]
[null,"AÑO:",null,"MES: "]
[null,"AÑO BASE:"]
[null,"DATOS PARA EL CÁLCULO DE LOS INDICADORES BÁSICOS"]
[null,"Número","Datos","Unidad","Cantidad","Column1","Año de reporte"]
[null,1,"Población Total","Habitantes",{"$f":"PobAtendida!G21","v":0},null,null,null,1]
[null,2,"Población con servicio de agua potable","Habitantes",{"$f":"'Tomas y coberturas'!M7","v":0},null,null,null,2]
[null,3,"Indice de hacinamiento","Habitantes",{"$f":"'Tomas y coberturas'!M9","v":0},null,null,null,"3.a"]
[null,4,"Total de tomas activas registradas","Tomas",{"$f":"'Tomas y coberturas'!C15","v":0},null,null,null,9]
[null,4.0999999999999996,"Tomas domésticas","Tomas",{"$f":"'Tomas y coberturas'!C$10","v":0},null,null,null,8]
[null,"4.1.1","Tomas domésticas con medidor","Tomas",{"$f":"'Tomas y coberturas'!D10","v":0},null,null,null,51]
[null,4.2,"Tomas comerciales","Tomas",{"$f":"'Tomas y coberturas'!C$11","v":0},null,null,null,8.1]
[null,"4.2.1","Tomas comerciales con medidor","Tomas",{"$f":"'Tomas y coberturas'!D11","v":0},null,null,null,52]
[null,4.3,"Tomas industriales","Tomas",{"$f":"'Tomas y coberturas'!C$12","v":0},null,null,null,8.1999999999999993]
[null,"4.3.1","Tomas industriales con medidor","Tomas",{"$f":"'Tomas y coberturas'!D12","v":0},null,null,null,53]
[null,4.4000000000000004,"Tomas servicio público","Tomas",{"$f":"'Tomas y coberturas'!C$13","v":0},null,null,null,8.3000000000000007]
[null,"4.4.1","Tomas servicios públicos con medidor","Tomas",{"$f":"'Tomas y coberturas'!D13","v":0},null,null,null,54]
[null,4.5,"Otras","Tomas",{"$f":"'Tomas y coberturas'!C$14","v":0},null,null,null,8.4]
[null,"4.5.1","Otras tomas con medidor","Tomas",{"$f":"'Tomas y coberturas'!D14","v":0},null,null,null,54.1]
[null,4.5999999999999996,"Micromedidores instalados funcionando","Unidad",{"$f":"Medescompuestos!H$19","v":0}]
[null,"4.6.1","Medidores hasta con 5 años de antigüedad","Tomas"]
[null,"4.6.2","Medidores entre 6 y 10 años de antigüedad","Tomas"]
[null,"4.6.3","Medidores con antigüedad mayor a 10 años","Tomas"]
[null,5,"Tomas con servicio continuo","Tomas",{"$f":"Sercontinuo!D$59","v":0},null,null,null,6]
[null,6,"Tomas conectadas al alcantarillado","Tomas",{"$f":"'Tomas y coberturas'!J15","v":0},null,null,null,9.1]
[null,7,"Volumen producido","m3/año",{"$f":"Produccion!P$163","v":0},null,null,null,7]
[null,7.1,"Producción anual de agua subterránea","m3/año",{"$f":"SUMIF(Produccion!D9:D158,\"<>AB\",Produccion!N9:N158)","v":0},null,null,null,19]
[null,7.2,"Producción anual de agua superficial","m3/año",{"$f":"SUMIF(Produccion!D9:D158,\"<>AB\",Produccion!O9:O158)","v":0},null,null,null,20]
[null,8,"Fuentes de abastecimiento activas","Unidad",{"$f":"Produccion!C159","v":0},null,null,null,13]
[null,8.1,"Macromedidores instalados funcionando","Unidad",{"$f":"Produccion!P166","v":0},null,null,null,12]
[null,9,"Volumen macromedido","m3/año",{"$f":"Produccion!M159","v":0},null,null,null,21]
[null,10,"Volumen de agua facturado","m3/año",{"$f":"Facturacion!E$14","v":0},null,null,null,15]
[null,11,"Volumen de agua residual tratado","m3/año",{"$f":"Tratamiento!E47","v":0},null,null,null,4]
[null,12,"Consumo medio","m3/mes",{"$f":"IFERROR(Facturacion!E14/'Tomas y coberturas'!C15/12,0)","v":0}]
[null,12.1,"Consumo medio doméstico","m3/mes",{"$f":"IFERROR(Facturacion!E9/'Tomas y coberturas'!C10/12,0)","v":0}]
[null,12.2,"Consumo medio comercial","m3/mes",{"$f":"IFERROR(Facturacion!E10/'Tomas y coberturas'!C11/12,0)","v":0}]
[null,12.3,"Consumo medio industrial","m3/mes",{"$f":"IFERROR(Facturacion!E11/'Tomas y coberturas'!C12/12,0)","v":0}]
[null,12.4,"Consumo medio servicio público","m3/mes",{"$f":"IFERROR(Facturacion!E12/'Tomas y coberturas'!C13/12,0)","v":0}]
[null,12.5,"Consumo medio otros","m3/mes",{"$f":"IFERROR(Facturacion!E13/'Tomas y coberturas'!C14/12,0)","v":0}]
[null,12,"Gastos operacionales","$",{"$f":"Costos!C36","v":0},null,null,null,11]
[null,13,"Gastos de energía eléctrica","$",{"$f":"Costos!C$31","v":0},null,null,null,10]
[null,14,"Sueldos y prestaciones","$",{"$f":"Costos!C$30","v":0},null,null,null,10.1]
[null,15,"Materiales","$",{"$f":"Costos!C$32","v":0},null,null,null,10.199999999999999]
[null,16,"Cloro y reactivos","$",{"$f":"Costos!C$35","v":0},null,null,null,10.3]
[null,17,"Derechos de explotación, uso o aprovechamiento de agua","$",{"$f":"+Costos!C33","v":0},null,null,null,75]
[null,18,"Otros gastos operacionales","$",{"$f":"+Costos!C34","v":0},null,null,null,11.1]
[null,19,"Otros gastos no operacionales (pagos de créditos u otros)","$",{"$f":"+Costos!C24+Costos!C22","v":0},null,null,null,10.4]
[null,20,"Número de empleados","empleados",{"$f":"Empleados!C22","v":0},null,null,null,18]
[null,{"$f":"+B51+1","v":21},"Capacidad instalada de tratamiento","lps",{"$f":"Tratamiento!E46","v":0},null,null,null,23]
[null,{"$f":"+B52+1","v":22},"Importe de agua, alcantarillado y saneamiento facturado","$",{"$f":"Facturacion!P5+Facturacion!P6+Facturacion!P7","v":0}]
[null,{"$f":"+B53+1","v":23},"Importe de agua, alcantarillado y saneamiento  recaudado","$",{"$f":"Deudxservicio!F$32","v":0}]
[null,24,"Facturación por agua potable ($)","$",{"$f":"Facturacion!I14","v":0},null,null,null,40]
[null,25,"Facturación por alcantarillado ($)","$",{"$f":"Facturacion!P6","v":0},null,null,null,41]
[null,26,"Facturación por saneamiento ($)","$",{"$f":"Facturacion!P7","v":0},null,null,null,42]
[null,27,"Ingresos por derechos de conexión","$",{"$f":"Facturacion!P8+Facturacion!P9","v":0},null,null,null,44.1]
[null,28,"Ingresos por factibilidades","$",{"$f":"Facturacion!P11","v":0},null,null,null,45]
[null,29,"Otros ingresos","$",{"$f":"+Facturacion!P10","v":0},null,null,null,46]
[null,30,"Ingresos por aportaciones federales, estatales o municipales","$",{"$f":"+BalanceG!H30+BalanceG!H31+BalanceG!H32","v":0},null,null,null,46.1]
[null,31,"Ingresos no operacionales (intereses u otros)","$",{"$f":"+Facturacion!P13","v":0},null,null,null,46.2]
[null,32,"Facturación total","$",{"$f":"Facturacion!P12","v":0},null,null,null,47]
[null,33,"Cuentas por Cobrar de más de 360 días","$"]
[null,34,"Número de PTARs","unidad",{"$f":"+COUNTIF(Tratamiento!E8:E37,\">0\")","v":0},null,null,null,4.2]
[null,35,"Número de Plantas potabilizadoras","unidad",{"$f":"+COUNTIF(Tratamiento!L8:L19,\">0\")","v":0},null,null,null,7.3]
[null,36,"Muestras totales bacteriológicas analizadas","unidad"]
[null,37,"Muestras bacteriológicas con cumplimiento de normatividad","unidad"]
[null,38,"Porcentaje de reposición a aplicar","%"]
[null,39,"Valor Nuevo de Reposición por toma (VNR)","$/Toma",34000]
[null,40,"Crecimiento Anual de las tomas","%",{"$f":"IFERROR(SemblanzaF!D9/SemblanzaF!C9-1,0)","v":0}]
[null,41,"% de financiamiento por el organismo del crecimiento","%",{"$f":"+IF('Proyecciones Base'!C9<15000,0.7,IF('Proyecciones Base'!C9<100000,0.6,IF('Proyecciones Base'!C9<500000,0.55,0.5)))","v":0.7}]
[null,{"$f":"+B72+1","v":42},"Pérdidas físicas no perceptibles en red","%",{"$f":"NoPerceptible!M9","v":0}]
[null,43,"Pérdidas físicas no perceptibles en tomas","%",{"$f":"NoPerceptible!M49","v":0}]
[null,44,"Pérdidas Comerciales respecto al total de pérdidas","%"]
[null,45,"Aporte a fondo perdido PRODI","%",0.5]
[]
[]
[null,"NOTAS:"]

{"sheet":"Acciones","index":5,"n_rows":49,"n_cols":9,"rows_kept":49,"cut":false,"hidden":false,"merged":[[1,1,1,2],[3,2,3,5],[4,2,4,5]]}
[]
[null,"Formato 3. ACCIONES A REALIZAR SEGÚN SEMÁFORO"]
[]
[null,"NOMBRE:",{"$f":"+Datos!C4","v":"X"}]
[null,"AÑO:",{"$f":"+Datos!C5","v":0}]
[]
[null,"No.","DESCRIPCIÓN","PAI","TIPO","FINANCIADA POR PRODI","COMENTARIOS","CRITERIOS DE SEMAFORIZACION","SEMAFORO"]
[null,1,"Solicitud de cambio de tarifa eléctrica para reducir gasto por concepto de energía eléctrica.","1. Reducción de gastos de energía eléctrica","1.Acción o inversión","no",null,{"$f":"\"Si la incidencia de energía es superior a \" & TEXT(Parametros!D15,\"##.0%\") & \" de los gastos operacionales y el factor de carga se encuentra por debajo del \" & TEXT(Parametros!D28,\"##.0%\") & \"  se debe realizar la actividad. Si la incidencia de energía se encuentra entre \" & TEXT(Parametros!C15,\"##.0%\") & \"  y \" & TEXT(Parametros!D15,\"##.0%\") & \"  y el factor de carga se encuentra por debajo del \" & TEXT(Parametros!D28,\"##.0%\") & \" se debe revisar por el consultor\"","v":"Si la incidencia de energía es superior a 10.0% de los gastos operacionales y el factor de carga se encuentra por debajo del 90.0%  se debe realizar la actividad. Si la incidencia de energía se encuentra entre 5.0%  y 10.0%  y el factor de carga se encuentra por debajo del 90.0% se debe revisar por el consultor"},{"$f":"+IF(AND(Indicadores!D18>Parametros!D15,Indicadores!D23<Parametros!D28),\"SI\",IF(AND(Indicadores!D18>Parametros!C15,Indicadores!D23<Parametros!D28),\"REVISAR\",\"NO\"))","v":"NO"}]
[null,{"$f":"1+B8","v":2},"Reducción de la potencia reactiva (reducción del factor de potencia)","1. Reducción de gastos de energía eléctrica","1.Acción o inversión","sí",null,{"$f":"\"Si la incidencia de energía es superior a \" & TEXT(Parametros!D15,\"##.0%\") & \" de los gastos operacionales y el factor de potencia se encuentra por debajo del \" & TEXT(Parametros!D29,\"##.0%\") & \"  se debe realizar la actividad. Si la incidencia de energía se encuentra entre \" & TEXT(Parametros!C15,\"##.0%\") & \"  y \" & TEXT(Parametros!D15,\"##.0%\") & \"  y el factor de potencia se encuentra por debajo del \" & TEXT(Parametros!D29,\"##.0%\") & \" se debe revisar por el consultor\"","v":"Si la incidencia de energía es superior a 10.0% de los gastos operacionales y el factor de potencia se encuentra por debajo del 80.0%  se debe realizar la actividad. Si la incidencia de energía se encuentra entre 5.0%  y 10.0%  y el factor de potencia se encuentra por debajo del 80.0% se debe revisar por el consultor"},{"$f":"+IF(AND(Indicadores!D18>Parametros!D15,Indicadores!D24<Parametros!D29),\"SI\",IF(AND(Indicadores!D18>Parametros!C15,Indicadores!D24<Parametros!D29),\"REVISAR\",\"NO\"))","v":"NO"}]
[null,{"$f":"1+B9","v":3},"Sustitución de equipos de bombeo de agua potable para reducir consumo de energía","1. Reducción de gastos de energía eléctrica","1.Acción o inversión","sí",null,{"$f":"\"Si la incidencia de energía es superior a \" & TEXT(2*Parametros!D15,\"##.0%\") & \" de los gastos operacionales  se debe realizar la actividad. Si la incidencia de energía se encuentra entre \" & TEXT(Parametros!D15,\"##.0%\") & \"  y \" & TEXT(2*Parametros!D15,\"##.0%\") & \"  se debe revisar por el consultor\"","v":"Si la incidencia de energía es superior a 20.0% de los gastos operacionales  se debe realizar la actividad. Si la incidencia de energía se encuentra entre 10.0%  y 20.0%  se debe revisar por el consultor"},{"$f":"+IF(Indicadores!D18>2*Parametros!D15,\"SI\",IF(AND(Indicadores!D18>Parametros!C15,Indicadores!D24<Parametros!D29),\"REVISAR\",\"NO\"))","v":"NO"}]
[null,4,"Sustitución o construcción de tanques de almacenamiento de agua para modificar políticas de operación del equipo de bombeo","1. Reducción de gastos de energía eléctrica","1.Acción o inversión","sí",null,{"$f":"\"Si la incidencia de energía es superior a \" & TEXT(Parametros!D15,\"##.0%\") & \" de los gastos operacionales y el consumo de energía en punta es superior al \" & TEXT(Parametros!C30,\"##.0%\") & \"  se debe realizar la actividad. Si la incidencia de energía se encuentra entre \" & TEXT(Parametros!C15,\"##.0%\") & \"  y \" & TEXT(Parametros!D15,\"##.0%\") & \"  y el consumo de energía en punta es superior al \" & TEXT(Parametros!C30,\"##.0%\") & \" se debe revisar por el consultor\"","v":"Si la incidencia de energía es superior a 10.0% de los gastos operacionales y el consumo de energía en punta es superior al 10.0%  se debe realizar la actividad. Si la incidencia de energía se encuentra entre 5.0%  y 10.0%  y el consumo de energía en punta es superior al 10.0% se debe revisar por el consultor"},{"$f":"+IF(AND(Indicadores!D18>Parametros!D15,Indicadores!D22>Parametros!C30),\"SI\",IF(AND(Indicadores!D18>Parametros!C15,,Indicadores!D22>Parametros!C30),\"REVISAR\",\"NO\"))","v":"NO"}]
[null,5,"Automatización de equipos de bombeo para modificar políticas de operación","1. Reducción de gastos de energía eléctrica","1.Acción o inversión","sí",null,{"$f":"+H10","v":"Si la incidencia de energía es superior a 20.0% de los gastos operacionales  se debe realizar la actividad. Si la incidencia de energía se encuentra entre 10.0%  y 20.0%  se debe revisar por el consultor"},{"$f":"+I10","v":"NO"}]
[null,6,"Sustitución de bombas de alcantarillado","1. Reducción de gastos de energía eléctrica","1.Acción o inversión","sí",null,{"$f":"+H10","v":"Si la incidencia de energía es superior a 20.0% de los gastos operacionales  se debe realizar la actividad. Si la incidencia de energía se encuentra entre 10.0%  y 20.0%  se debe revisar por el consultor"},{"$f":"+I10","v":"NO"}]
[null,7,"Reducción de gastos de energía en plantas de tratamiento de aguas residuales (PTAR)","1. Reducción de gastos de energía eléctrica","1.Acción o inversión","sí",null,{"$f":"+H13","v":"Si la incidencia de energía es superior a 20.0% de los gastos operacionales  se debe realizar la actividad. Si la incidencia de energía se encuentra entre 10.0%  y 20.0%  se debe revisar por el consultor"},{"$f":"+I10","v":"NO"}]
[null,8,"Elaboración de una auditoría energética","1. Reducción de gastos de energía eléctrica","0.Estudio previo","con justificación","Es necesario se realice para conocer las acciones necesarias específicas para hacer mas eficinete  el consumo de energía eléctrica.",{"$f":"\"Si la incidencia de energía es superior a \" & TEXT(Parametros!D15,\"##.0%\") & \" de los gastos operacionales,  se debe realizar la actividad. Si la incidencia de energía se encuentra entre \" & TEXT(Parametros!C15,\"##.0%\") & \"  y \" & TEXT(Parametros!D15,\"##.0%\") & \", se debe revisar por el consultor\"","v":"Si la incidencia de energía es superior a 10.0% de los gastos operacionales,  se debe realizar la actividad. Si la incidencia de energía se encuentra entre 5.0%  y 10.0%, se debe revisar por el consultor"},{"$f":"+IF(Indicadores!D18>Parametros!D15,\"SI\",IF(Indicadores!D18>Parametros!C15,\"REVISAR\",\"NO\"))","v":"NO"}]
[null,9,"Programa de capacitación y profesionalización para incrementar la productividad del personal.","2. Reducción de gastos de personal","2.Sostenibilidad","sí","La capacitación laboral es muy recomendable, ay que permite aumentar el conocimiento de los equipos y maquinaria que se usa diariamente, para incrementar la eficiencia laboral.",{"$f":"\"Si el índice de personal está por sobre \" & TEXT(Parametros!D8,\"##.0\") & \"  empleados por cada 1,000 tomas, se debe realizar la actividad.\nSi el índice de personal está entre \" & TEXT(Parametros!C8,\"##.0\") & \"  y  \" & TEXT(Parametros!D8,\"##.0\") & \"  empleados por cada mil tomas, se debe revisar por el consultor\"","v":"Si el índice de personal está por sobre 6.0  empleados por cada 1,000 tomas, se debe realizar la actividad.\rSi el índice de personal está entre 4.0  y  6.0  empleados por cada mil tomas, se debe revisar por el consultor"},{"$f":"+IF(Indicadores!D28>Parametros!D8,\"SI\",IF(Indicadores!D28>Parametros!C8,\"REVISAR\",\"NO\"))","v":"NO"}]
[null,10,"Revisión del manual de funciones y cargos del personal del OO","2. Reducción de gastos de personal","0.Estudio previo","con justificación",null,{"$f":"\"Si el índice de personal está por sobre \" & TEXT(Parametros!D8,\"##.0\") & \"  empleados por cada 1,000 tomas  o el personal operativo es menos del  \" & TEXT(Parametros!C17,\"##.0%\") & \", se debe realizar la actividad.\nSi el índice de personal está entre \" & TEXT(Parametros!C8,\"##.0\") & \"  y  \" & TEXT(Parametros!D8,\"##.0\") & \"  empleados por cada mil tomas o el % de personal operativo está entre el \" & TEXT(Parametros!C17,\"##.0%\") & \" y el \" & TEXT(Parametros!D17,\"##.0%\") & \", se debe revisar por el consultor\"","v":"Si el índice de personal está por sobre 6.0  empleados por cada 1,000 tomas  o el personal operativo es menos del  30.0%, se debe realizar la actividad.\rSi el índice de personal está entre 4.0  y  6.0  empleados por cada mil tomas o el % de personal operativo está entre el 30.0% y el 50.0%, se debe revisar por el consultor"},{"$f":"+IF(OR(Indicadores!D28>Parametros!D8,Indicadores!D31<Parametros!C17),\"SI\",IF(OR(Indicadores!D28>Parametros!C8,Indicadores!D31<Parametros!D17),\"REVISAR\",\"NO\"))","v":"SI"}]
[null,11,"Establecimiento de un programa de retiro voluntario y obligado","2. Reducción de gastos de personal","1.Acción o inversión","no",null,{"$f":"+H16","v":"Si el índice de personal está por sobre 6.0  empleados por cada 1,000 tomas, se debe realizar la actividad.\rSi el índice de personal está entre 4.0  y  6.0  empleados por cada mil tomas, se debe revisar por el consultor"},{"$f":"+I16","v":"NO"}]
[null,12,"Ajuste de consumos de cuota fija","3. Mejora de la gestión comercial","1.Acción o inversión","sí",null,{"$f":" \"Cuando el valor de la cuota fija se encuentra entre el \" & TEXT(Parametros!C19, \"##%\") & \" y el \" & TEXT(Parametros!D19, \"##%\") & \" del valor del servicio medido se revisa a criterio del consultor.   Si el valor es menor al \"  & TEXT(Parametros!C19, \"##%\") & \" se lleva a cabo la actividad\"","v":"Cuando el valor de la cuota fija se encuentra entre el 90% y el 110% del valor del servicio medido se revisa a criterio del consultor.   Si el valor es menor al 90% se lleva a cabo la actividad"},{"$f":"IF(Indicadores!D41>Parametros!C11,\"NO\",IF(Indicadores!D48*Parametros!C19>Indicadores!D49,\"SI\",IF(Indicadores!D48*Parametros!D19<Indicadores!D49,\"NO\",\"REVISAR\")))","v":"REVISAR"}]
[null,13,"Corrección de errores de micromedición mediante sustitución de medidores.","3. Mejora de la gestión comercial","1.Acción o inversión","sí",null,{"$f":"\"Si del total del parque de medidores se tiene que entre el  \" & TEXT(Parametros!C20, \"##%\") & \" y  \" & TEXT(Parametros!D20, \"##%\") & \" de ellos tienen una antigüedad menor a 5 años se revisa a criterio del consultor.   Si el valor es menor al  \" & TEXT(Parametros!C20, \"##%\") & \" se lleva a cabo la actividad.\"","v":"Si del total del parque de medidores se tiene que entre el  60% y  80% de ellos tienen una antigüedad menor a 5 años se revisa a criterio del consultor.   Si el valor es menor al  60% se lleva a cabo la actividad."},{"$f":"IF(1-Indicadores!D54>Parametros!D20,\"NO\",IF(1-Indicadores!D54>1-Parametros!C20,\"REVISAR\",\"SI\"))","v":"NO"}]
[null,14,"Impartición de cursos de formación de recursos humanos en eficiencia comercial","3. Mejora de la gestión comercial","2.Sostenibilidad","sí",null,{"$f":"CONCATENATE(\"Si la eficiencia comercial se encuentra en un rango entre  \", TEXT(Parametros!C14, \"##.0%\"), \" y \", TEXT(Parametros!D14, \"##.0%\"),\" y no esta facultado para llevar a cabo el corte del servicio en usuarios domésticos, se revisa a criterio del consultor. Si la eficiencia comercial es inferior al \",TEXT(Parametros!C14, \"##.0%\"), \"y no está facultado para ejecutar los cortes de servicio a usuarios domésticos se lleva a cabo la actividad.\")","v":"Si la eficiencia comercial se encuentra en un rango entre  70.0% y 90.0% y no esta facultado para llevar a cabo el corte del servicio en usuarios domésticos, se revisa a criterio del consultor. Si la eficiencia comercial es inferior al 70.0%y no está facultado para ejecutar los cortes de servicio a usuarios domésticos se lleva a cabo la actividad."},{"$f":"IF(AND(Practicas!C18=\"SI\",Indicadores!D38<Parametros!D14),\"SI\",IF(AND(Practicas!C18=\"NO\",Indicadores!D38<Parametros!C14),\"SI\",IF(AND(Practicas!C18=\"NO\",Indicadores!D38<Parametros!C14),\"REVISAR\",\"NO\")))","v":"NO"}]
[null,15,"Impartición de cursos de formación de recursos humanos en atención a usuarios","3. Mejora de la gestión comercial","2.Sostenibilidad","sí",null,{"$f":"+H21","v":"Si la eficiencia comercial se encuentra en un rango entre  70.0% y 90.0% y no esta facultado para llevar a cabo el corte del servicio en usuarios domésticos, se revisa a criterio del consultor. Si la eficiencia comercial es inferior al 70.0%y no está facultado para ejecutar los cortes de servicio a usuarios domésticos se lleva a cabo la actividad."},{"$f":"IF(AND(Practicas!C18=\"SI\",Indicadores!D38<Parametros!D14),\"SI\",IF(AND(Practicas!C18=\"NO\",Indicadores!D38<Parametros!C14),\"SI\",IF(AND(Practicas!C18=\"NO\",Indicadores!D38<Parametros!C14),\"REVISAR\",\"NO\")))","v":"NO"}]
[null,16,"Firma de convenios con bancos y otras instituciones para ampliar las opciones de pago de los servicios de agua y saneamiento","3. Mejora de la gestión comercial","1.Acción o inversión","sí",null,{"$f":"+H22","v":"Si la eficiencia comercial se encuentra en un rango entre  70.0% y 90.0% y no esta facultado para llevar a cabo el corte del servicio en usuarios domésticos, se revisa a criterio del consultor. Si la eficiencia comercial es inferior al 70.0%y no está facultado para ejecutar los cortes de servicio a usuarios domésticos se lleva a cabo la actividad."},{"$f":"IF(AND(Practicas!C18=\"SI\",Indicadores!D38<Parametros!D14),\"SI\",IF(AND(Practicas!C18=\"NO\",Indicadores!D38<Parametros!C14),\"SI\",IF(AND(Practicas!C18=\"NO\",Indicadores!D38<Parametros!C14),\"REVISAR\",\"NO\")))","v":"NO"}]
[null,17,"Mejoras a la facturación mediante un nuevo sistema comercial","3. Mejora de la gestión comercial","1.Acción o inversión","sí","de acuerdo al esquema tarifario actual, solo se \"factura\" bajo el criterio e cuota fija, se sugiere un nuevo sitema que permita el uso de criterios de facturacion del servicio, bajo los cirtrios de servicio medido o cuota fija, desagregado servicio y llevando control de la gestiónd el acobranza ",{"$f":"CONCATENATE(\"Si la calidad de la información, la facilidad de obtención y el grado de confiabilidad de la misma se encuentra entre\", TEXT(Parametros!C21, \"#\"),  \" y \", TEXT(Parametros!D21, \"#\"), \", se revisa a criterio del consultor la necesidad de la implementación de un sistema comercial.   Si la calidad de la información, la facilidad de obtención y el grado de confiabilidad es menor a \", TEXT(Parametros!C21, \"#\"), \", se debe considerar el cambio del sistema comercial.\")","v":"Si la calidad de la información, la facilidad de obtención y el grado de confiabilidad de la misma se encuentra entre4 y 6, se revisa a criterio del consultor la necesidad de la implementación de un sistema comercial.   Si la calidad de la información, la facilidad de obtención y el grado de confiabilidad es menor a 4, se debe considerar el cambio del sistema comercial."},{"$f":"+IF(Practicas!C24<Parametros!C21,\"SI\",IF(AND(Practicas!C24<=Parametros!D21,Practicas!C24>=Parametros!C21),\"REVISAR\",\"NO\"))","v":"SI"}]
[null,18,"Mejoras en la cobranza mediante esquemas que faciliten el pago.","3. Mejora de la gestión comercial","1.Acción o inversión","sí",null,{"$f":"+H21","v":"Si la eficiencia comercial se encuentra en un rango entre  70.0% y 90.0% y no esta facultado para llevar a cabo el corte del servicio en usuarios domésticos, se revisa a criterio del consultor. Si la eficiencia comercial es inferior al 70.0%y no está facultado para ejecutar los cortes de servicio a usuarios domésticos se lleva a cabo la actividad."},{"$f":"IF(AND(Practicas!C18=\"SI\",Indicadores!D38<Parametros!D14),\"SI\",IF(AND(Practicas!C18=\"NO\",Indicadores!D38<Parametros!C14),\"SI\",IF(AND(Practicas!C18=\"NO\",Indicadores!D38<Parametros!C14),\"REVISAR\",\"NO\")))","v":"NO"}]
[null,19,"Localización y regularización de tomas clandestinas","3. Mejora de la gestión comercial","1.Acción o inversión","sí",null,{"$f":"CONCATENATE(\"Si el volúmen de agua tratada es mayor al \", TEXT(Parametros!D24, \"##.0%\"), \" del volumen de agua potable facturada o la cobertura de agua potable es menor al \", TEXT(Parametros!C10, \"##.0%\"), \" o la eficiencia física es menor al \",TEXT(Parametros!C9, \"##.0%\"), \", se lleva a cabo la actividad.   Si el producto de estos tres factores resulta entre \", TEXT(Parametros!C25, \"#0.0\"), \" y \", TEXT(Parametros!D25, \"#0.0\"), \" el factor máximo del volumen de agua facturada y el volumen de agua tratada es 1.1, se debe revisar\")","v":"Si el volúmen de agua tratada es mayor al 110.0% del volumen de agua potable facturada o la cobertura de agua potable es menor al 90.0% o la eficiencia física es menor al 60.0%, se lleva a cabo la actividad.   Si el producto de estos tres factores resulta entre 0.4 y 0.6 el factor máximo del volumen de agua facturada y el volumen de agua tratada es 1.1, se debe revisar"},{"$f":"+IF(OR(Indicadores!D72>Parametros!D24,Indicadores!D9<Parametros!C10,Indicadores!D64<Parametros!C9),\"SI\",IF(AND(Indicadores!D72*Indicadores!D9*Indicadores!D64<Parametros!D25,Indicadores!D72*Indicadores!D9*Indicadores!D64>Parametros!C25),\"REVISAR\",\"NO\"))","v":"SI"}]
[null,20,"Censo de usuarios para mejorar el padrón. Establecimiento de esquemas de actualización continua del padrón.","3. Mejora de la gestión comercial","1.Acción o inversión","sí","Es muy recomendable llevar a cabo un aactualziación del Padrón de Usuarios, para validar el giro, uso y localización georeferenciada de cada uno de los usuarios.",{"$f":"+H26","v":"Si el volúmen de agua tratada es mayor al 110.0% del volumen de agua potable facturada o la cobertura de agua potable es menor al 90.0% o la eficiencia física es menor al 60.0%, se lleva a cabo la actividad.   Si el producto de estos tres factores resulta entre 0.4 y 0.6 el factor máximo del volumen de agua facturada y el volumen de agua tratada es 1.1, se debe revisar"},{"$f":"+I26","v":"SI"}]
[null,21,"Sistema de cómputo para altas y bajas del padrón de usuarios.","3. Mejora de la gestión comercial","1.Acción o inversión","sí","Como complemento ala actualzciónd el padron y como un módulo del Sistema coemrcial a implmentar, se sugiere el facilitar la gestión de la actalizacion cotidaina del Padrón.",{"$f":"+H27","v":"Si el volúmen de agua tratada es mayor al 110.0% del volumen de agua potable facturada o la cobertura de agua potable es menor al 90.0% o la eficiencia física es menor al 60.0%, se lleva a cabo la actividad.   Si el producto de estos tres factores resulta entre 0.4 y 0.6 el factor máximo del volumen de agua facturada y el volumen de agua tratada es 1.1, se debe revisar"},{"$f":"+I26","v":"SI"}]
[null,22,"Estudio tarifario con el fin de realizar la actualización de las tarifas de agua","3. Mejora de la gestión comercial","0.Estudio previo","con justifi",null,{"$f":"\"Si la tarifa media por m3 esta entre \" & TEXT(Parametros!C13, \"#0.0\") & \" y \" & TEXT(Parametros!D13, \"#0.0\") & \" pesos, será revisada a criterio del consultor.   Si es inferior a \" & TEXT(Parametros!C13, \"#0.0\") & \" se realiza la acción.\"","v":"Si la tarifa media por m3 esta entre 10.0 y 15.0 pesos, será revisada a criterio del consultor.   Si es inferior a 10.0 se realiza la acción."},{"$f":"+IF(Indicadores!D44<Parametros!C13,\"SI\",IF(Indicadores!D44<Parametros!D13,\"REVISAR\",\"NO\"))","v":"SI"}]
[null,23,"Modificaciones a la estructura tarifaria","3. Mejora de la gestión comercial","1.Acción o inversión","no",null,{"$f":"CONCATENATE(\"Si la tarifa media de los clientes no domésticos se encuentra entre una realción de \", TEXT(Parametros!C26, \"#0.0\"), \" a \", TEXT(Parametros!D26, \"#0.0\"), \" respecto a la tarifa media de los clientes domésticos, se deja a criterio del consultor la revisión de la estructura tarifaria.    Si la relación es mayor al \",  TEXT(Parametros!D26, \"#0.0\"), \", se realiza la actividad.\")","v":"Si la tarifa media de los clientes no domésticos se encuentra entre una realción de 1.5 a 2.5 respecto a la tarifa media de los clientes domésticos, se deja a criterio del consultor la revisión de la estructura tarifaria.    Si la relación es mayor al 2.5, se realiza la actividad."},{"$f":"IFERROR(IF(Indicadores!D46/Indicadores!D45>Parametros!D26,\"SI\",IF(Indicadores!D46/Indicadores!D45>Parametros!C26,\"REVISAR\",\"NO\")),\"NO\")","v":"NO"}]
[null,24,"Reformas para lograr que las tarifas se actualicen de manera continua","3. Mejora de la gestión comercial","4.Estructural","sí",null,null,{"$f":"+IF(Practicas!C12=\"NO\",\"SI\",\"NO\")","v":"NO"}]
[null,25,"Reformas al marco legal para que el OO pueda establecer tarifas adecuadas","3. Mejora de la gestión comercial","4.Estructural","sí",null,null,{"$f":"+IF(Practicas!C11=\"NO\",\"SI\",\"NO\")","v":"NO"}]
[null,26,"Localización y reparación de fugas en tanques","4. Reducción de pérdidas físicas de agua","1.Acción o inversión","sí",null,{"$f":"\"Si la eficiencia física es menor  \" & TEXT(Parametros!C9, \"#0.0%\") & \"  y las pérdidas físicas en tanques son mayores a  \" & TEXT(Parametros!D31, \"#0.0%\") & \"   se debe realizar esta actividad. Si la eficiencia física es menor a  \" & TEXT(Parametros!C9, \"#0.0%\") & \"   y las pérdidas en tanques son menores a  \" & TEXT(Parametros!D31, \"#0.0%\") & \" se debe analizar por el consultor.\"","v":"Si la eficiencia física es menor  60.0%  y las pérdidas físicas en tanques son mayores a  1.0%   se debe realizar esta actividad. Si la eficiencia física es menor a  60.0%   y las pérdidas en tanques son menores a  1.0% se debe analizar por el consultor."},{"$f":"+IF(AND(Indicadores!D64<Parametros!C9,Indicadores!D74>Parametros!D31),\"SI\",IF(Indicadores!D64<Parametros!C9,\"REVISAR\",\"NO\"))","v":"REVISAR"}]
[null,27,"Localización y reparación de fugas en tuberías principales y secundarias","4. Reducción de pérdidas físicas de agua","1.Acción o inversión","con justificación",null,{"$f":"\"Si la eficiencia física es menor a \" & TEXT(Parametros!C9, \"##%\") & \" y las pérdidas invisibles en la red son mayores a \" & TEXT(Parametros!D32, \"##%\") & \" se debe realizar esta actividad. Si la eficiencia física es menor a \" &  TEXT(Parametros!C9, \"##%\") & \", se debe analizar por el consultor\"","v":"Si la eficiencia física es menor a 60% y las pérdidas invisibles en la red son mayores a 5% se debe realizar esta actividad. Si la eficiencia física es menor a 60%, se debe analizar por el consultor"},{"$f":"+IF(AND(Indicadores!D64<Parametros!C9,Indicadores!D73>Parametros!D32),\"SI\",IF(Indicadores!D64<Parametros!C9,\"REVISAR\",\"NO\"))","v":"REVISAR"}]
[null,28,"Instalación de micromedidores en las tomas","4. Reducción de pérdidas físicas de agua","2.Sostenibilidad","sí",null,{"$f":"\"Si la cobertura de micromedición se encuentra entre el \" & TEXT(Parametros!C11, \"##%\") & \" y el \" & TEXT(Parametros!D11, \"##%\") & \" se revisa a criterio del consultor.   Si la cobertura de micromedición es inferior al \" & TEXT(Parametros!C11, \"##%\") & \" se lleva a cabo la actividad.\"","v":"Si la cobertura de micromedición se encuentra entre el 85% y el 95% se revisa a criterio del consultor.   Si la cobertura de micromedición es inferior al 85% se lleva a cabo la actividad."},{"$f":"+IF(Indicadores!D40<Parametros!C11,\"SI\",IF(Indicadores!D40<Parametros!D11,\"REVISAR\",\"NO\"))","v":"SI"}]
[null,29,"Sistematización de lectura de micromedidores en tomas e incorporación de lecturas al sistema de facturación y cobranza","4. Reducción de pérdidas físicas de agua","2.Sostenibilidad","sí",null,{"$f":"\"Si la eficiencia física es menor a \" & TEXT(Parametros!C9, \"##%\") & \" y la incidencia de las pérdidas comerciales es mayor al \" & TEXT(Parametros!C33, \"##%\") & \", se realiza la acción. Si la eficiencia física está entre \" & TEXT(Parametros!C9, \"##%\") & \" y \" & TEXT(Parametros!D9, \"##%\") & \" y la incidencia de las pérdidas comerciales es mayor al \" & TEXT(Parametros!C33, \"##%\") & \" se debe revisar por el consultor.\"","v":"Si la eficiencia física es menor a 60% y la incidencia de las pérdidas comerciales es mayor al 30%, se realiza la acción. Si la eficiencia física está entre 60% y 75% y la incidencia de las pérdidas comerciales es mayor al 30% se debe revisar por el consultor."},{"$f":"+IF(AND(Indicadores!D64<Parametros!C9,Indicadores!D56>Parametros!C33),\"SI\",IF(AND(Indicadores!D64<Parametros!D9,Indicadores!D56>Parametros!C33),\"REVISAR\",\"NO\"))","v":"NO"}]
[null,30,"Optimización hidráulica: sectorización de la red de distribución, control de presión, optimización de la capacidad de almacenamiento.","4. Reducción de pérdidas físicas de agua","2.Sostenibilidad","sí",null,{"$f":"\"Si la eficiencia física es menor a \" & TEXT(Parametros!C9, \"##%\") & \" y la continuidad es inferior a \" & TEXT(Parametros!D12, \"##%\") & \" se debe realizar esta actividad. Si la eficiencia física es menor a \" & TEXT(Parametros!C9, \"##%\") & \" y la continuidad es igual al  \" & TEXT(Parametros!D12, \"##%\") & \" se debe analizar por el consultor\"","v":"Si la eficiencia física es menor a 60% y la continuidad es inferior a 100% se debe realizar esta actividad. Si la eficiencia física es menor a 60% y la continuidad es igual al  100% se debe analizar por el consultor"},{"$f":"+IF(AND(Indicadores!D64<Parametros!C9,Indicadores!D65<Parametros!D12),\"SI\",IF(AND(Indicadores!D64<Parametros!C9,Indicadores!D65=Parametros!D12),\"REVISAR\",\"NO\"))","v":"SI"}]
[null,31,"Catastro de infraestructura hidráulica y de redes","4. Reducción de pérdidas físicas de agua","2.Sostenibilidad","sí",null,{"$f":"\"Si la eficiencia física es menor a  \" & TEXT(Parametros!C9, \"##%\") & \" y no se cuenta con un catastro, ni con procedimientos que garanticen su actualización continua esta actividad se debe realizar. Si la eficiencia física es menor a \"  & TEXT(Parametros!C9, \"##%\") & \", se cuenta con catastro pero no se cuenta con procedimientos de actualización se debe analizar por el consultor\"","v":"Si la eficiencia física es menor a  60% y no se cuenta con un catastro, ni con procedimientos que garanticen su actualización continua esta actividad se debe realizar. Si la eficiencia física es menor a 60%, se cuenta con catastro pero no se cuenta con procedimientos de actualización se debe analizar por el consultor"},{"$f":"+IF(AND(Indicadores!D64<Parametros!C9,Practicas!C21=\"no\",Practicas!C22=\"no\"),\"SI\",IF(AND(Indicadores!D64<Parametros!C9,Practicas!C22=\"no\"),\"REVISAR\",\"NO\"))","v":"NO"}]
[null,32,"Instalación de macromedidores en captaciones","4. Reducción de pérdidas físicas de agua","2.Sostenibilidad","sí",null,{"$f":"\"Si el volumen macromedido es inferior al 100% se debe realizar esta actividad\"","v":"Si el volumen macromedido es inferior al 100% se debe realizar esta actividad"},{"$f":"+IF(Indicadores!D71<1,\"SI\",\"NO\")","v":"SI"}]
[null,33,"Instalación de macromedidores en sectores","4. Reducción de pérdidas físicas de agua","2.Sostenibilidad","sí",null,{"$f":"\"Si la eficiencia física es menor a \" & TEXT(Parametros!C9, \"##%\") & \" y la confiabilidad de la sectorización es menor a \" & TEXT(Parametros!C34, \"#\") & \" se debe realizar esta actividad. Si la eficiencia física es menor a \" & TEXT(Parametros!C9, \"##%\") & \" y la confiabilidad de la sectorización es igual o superior a \" & TEXT(Parametros!C34, \"#\") & \" se debe analizar por el consultor\"","v":"Si la eficiencia física es menor a 60% y la confiabilidad de la sectorización es menor a 7 se debe realizar esta actividad. Si la eficiencia física es menor a 60% y la confiabilidad de la sectorización es igual o superior a 7 se debe analizar por el consultor"},{"$f":"+IF(AND(Indicadores!D64<Parametros!C9,Practicas!C23<Parametros!C34),\"SI\",IF(Indicadores!D64<Parametros!C9,\"REVISAR\",\"NO\"))","v":"SI"}]
[null,34,"Sistematización de lectura de macromedidores en captaciones y sectores ( p.ej. a través de telemetría)","4. Reducción de pérdidas físicas de agua","2.Sostenibilidad","sí",null,{"$f":"\"Si la eficiencia física es menor a  \" & TEXT(Parametros!C9, \"##%\") & \"  y el volumen macromedido es superior a  \" & TEXT(Parametros!C18, \"##%\") & \"  se debe realizar esta actividad. Si la eficiencia física es menor a  \" & TEXT(Parametros!C9, \"##%\") & \" y el volumen macromedido es inferior a \" & TEXT(Parametros!C18, \"##%\") & \" se debe analizar por el consultor\"","v":"Si la eficiencia física es menor a  60%  y el volumen macromedido es superior a  80%  se debe realizar esta actividad. Si la eficiencia física es menor a  60% y el volumen macromedido es inferior a 80% se debe analizar por el consultor"},{"$f":"+IF(AND(Indicadores!D64<Parametros!C9,Indicadores!D71>Parametros!C18),\"SI\",IF(Indicadores!D64<Parametros!C9,\"REVISAR\",\"NO\"))","v":"REVISAR"}]
[null,35,"Sustitución de tuberías con alto índice de fugas","4. Reducción de pérdidas físicas de agua","2.Sostenibilidad","sí",null,{"$f":"\"Si la eficiencia física es menor a  \" & TEXT(Parametros!C9, \"##%\") & \",  se debe realizar esta actividad. Si la eficiencia física está entre  \" & TEXT(Parametros!C9, \"##%\") & \" y  \" & TEXT(Parametros!D9, \"##%\") & \", se debe analizar por el consultor\"","v":"Si la eficiencia física es menor a  60%,  se debe realizar esta actividad. Si la eficiencia física está entre  60% y  75%, se debe analizar por el consultor"},{"$f":"+IF(Indicadores!D64<Parametros!C9,\"SI\",IF(Indicadores!D64<Parametros!D9,\"REVISAR\",\"NO\"))","v":"SI"}]
[null,36,"Capacitación del personal del OO en operación de equipos","4. Reducción de pérdidas físicas de agua","2.Sostenibilidad","sí",null,{"$f":"+H42","v":"Si la eficiencia física es menor a  60%,  se debe realizar esta actividad. Si la eficiencia física está entre  60% y  75%, se debe analizar por el consultor"},{"$f":"+IF(Indicadores!D64<Parametros!C9,\"SI\",IF(Indicadores!D64<Parametros!D9,\"REVISAR\",\"NO\"))","v":"SI"}]
[null,37,"Sistema de Información Geográfica","4. Reducción de pérdidas físicas de agua","2.Sostenibilidad","sí",null,{"$f":"\"Si la eficiencia física es menor a  \" & TEXT(Parametros!C9, \"##%\") & \" y se cuenta con un catastro de redes se debe realizar esta actividad. Si la eficiencia física es menor a  \" & TEXT(Parametros!C9, \"##%\") & \" y no se cuenta con un catastro de redes se debe revisar por el consultor\"","v":"Si la eficiencia física es menor a  60% y se cuenta con un catastro de redes se debe realizar esta actividad. Si la eficiencia física es menor a  60% y no se cuenta con un catastro de redes se debe revisar por el consultor"},{"$f":"+IF(AND(Indicadores!D64<Parametros!C9,Practicas!C20=\"no\"),\"SI\",IF(Indicadores!D64<Parametros!C9,\"REVISAR\",\"NO\"))","v":"REVISAR"}]
[null,38,"Establecimiento de un comité ciudadano del organismo operador","5. Sostenibilidad de inversiones","2.Sostenibilidad","no",null,null,{"$f":"+IF(OR(Practicas!C9=\"NO\",Practicas!C8=\"NO\"),\"SI\",\"NO\")","v":"NO"}]
[null,39,"Elaboración de un código de ética y suscripción por parte del personal del OO","5. Sostenibilidad de inversiones","2.Sostenibilidad","no",null,null,{"$f":"+IF(OR(Practicas!C14=\"NO\",Practicas!C15=\"NO\"),\"SI\",\"NO\")","v":"NO"}]
[null,40,"Sistema informático de contabilidad","5. Sostenibilidad de inversiones","2.Sostenibilidad","sí",null,null,{"$f":"+IF(Practicas!C13=\"NO\",\"SI\",\"NO\")","v":"NO"}]
[null,41,"Sistema de planeación Integral","5. Sostenibilidad de inversiones","2.Sostenibilidad","sí",null,null,{"$f":"+IF(OR(Practicas!C16=\"NO\",Practicas!C17=\"NO\"),\"SI\",\"NO\")","v":"NO"}]
[null,42,"Asesoría para financiamiento de contraparte","5. Sostenibilidad de inversiones","2.Sostenibilidad","sí",null,{"$f":"\"Si las necesidades de financiamiento son más del  \" & TEXT(Parametros!D35, \"##%\") & \" de los ingresos anuales  se debe realizar esta actividad. Entre  \" & TEXT(Parametros!C35, \"##%\") & \" y  \" & TEXT(Parametros!D35, \"##%\") & \" queda a consideración del consultor\"","v":"Si las necesidades de financiamiento son más del  30% de los ingresos anuales  se debe realizar esta actividad. Entre  10% y  30% queda a consideración del consultor"},{"$f":"+IF(Indicadores!D114>Parametros!D35,\"SI\",IF(Indicadores!D114>Parametros!C35,\"REVISAR\",\"NO\"))","v":"NO"}]

{"sheet":"SemblanzaF","index":6,"n_rows":100,"n_cols":8,"rows_kept":100,"cut":false,"hidden":false,"merged":[[68,2,78,6],[1,1,1,2],[3,2,3,8],[4,2,4,8]]}
[]
[null,"Formato 4. SEMBLANZA FINANCIERA"]
[]
[null,"NOMBRE:",{"$f":"+Datos!C4","v":"X"}]
[null,"AÑO:",{"$f":"+Datos!C5","v":0}]
[]
[null,"Servicio",{"$f":"+Datos!C6","v":0},{"$f":"+C7+1","v":1},{"$f":"+D7+1","v":2},{"$f":"+E7+1","v":3},{"$f":"+F7+1","v":4},{"$f":"+G7+1","v":5}]
[null,"DEMANDA"]
[null,"Habitantes",{"$f":"+'Proyecciones Base'!C9","v":0},{"$f":"+'Proyecciones Base'!D9","v":0},{"$f":"+'Proyecciones Base'!E9","v":0},{"$f":"+'Proyecciones Base'!F9","v":0},{"$f":"+'Proyecciones Base'!G9","v":0},{"$f":"+'Proyecciones Base'!H9","v":0}]
[null,"Total Tomas",{"$f":"+C11+C12","v":0},{"$f":"IFERROR(D9*C10/C9,0)","v":0},{"$f":"IFERROR(E9*D10/D9,0)","v":0},{"$f":"IFERROR(F9*E10/E9,0)","v":0},{"$f":"IFERROR(G9*F10/F9,0)","v":0},{"$f":"IFERROR(H9*G10/G9,0)","v":0}]
[null,"Tomas Medidas",{"$f":"+Datos!E23","v":0},{"$f":"+D10*D21","v":0},{"$f":"+E10*E21","v":0},{"$f":"+F10*F21","v":0},{"$f":"+G10*G21","v":0},{"$f":"+H10*H21","v":0}]
[null,"Tomas Cuota Fija",{"$f":"+Datos!E12-C11","v":0},{"$f":"+D10-D11","v":0},{"$f":"+E10-E11","v":0},{"$f":"+F10-F11","v":0},{"$f":"+G10-G11","v":0},{"$f":"+H10-H11","v":0}]
[null,"Facturación anual por toma  servicio medido ($/toma/año) INTEGRADA",{"$f":"+Indicadores!D48","v":0},{"$f":"+'Proyecciones Base'!D30","v":0},{"$f":"+'Proyecciones Base'!E30","v":0},{"$f":"+'Proyecciones Base'!F30","v":0},{"$f":"+'Proyecciones Base'!G30","v":0},{"$f":"+'Proyecciones Base'!H30","v":0}]
[null,"Facturación anual por toma cuota fija ($/toma/año) INTEGRADA",{"$f":"+Indicadores!D49","v":0},{"$f":"+'Proyecciones Base'!D29","v":0},{"$f":"+'Proyecciones Base'!E29","v":0},{"$f":"+'Proyecciones Base'!F29","v":0},{"$f":"+'Proyecciones Base'!G29","v":0},{"$f":"+'Proyecciones Base'!H29","v":0}]
[null,"Facturación alcantarillado por toma ($/toma/año)",{"$f":"IFERROR(Facturacion!K14/'Tomas y coberturas'!J15,0)","v":0},{"$f":"+C15*IFERROR('Proyecciones Base'!D31/'Proyecciones Base'!C31,0)","v":0},{"$f":"+D15*IFERROR('Proyecciones Base'!E31/'Proyecciones Base'!D31,0)","v":0},{"$f":"+E15*IFERROR('Proyecciones Base'!F31/'Proyecciones Base'!E31,0)","v":0},{"$f":"+F15*IFERROR('Proyecciones Base'!G31/'Proyecciones Base'!F31,0)","v":0},{"$f":"+G15*IFERROR('Proyecciones Base'!H31/'Proyecciones Base'!G31,0)","v":0}]
[null,"Facturación por saneamiento  por toma($/toma/año)",{"$f":"IFERROR(Facturacion!L14/'Tomas y coberturas'!J15,0)","v":0},{"$f":"+C16*IFERROR('Proyecciones Base'!D31/'Proyecciones Base'!C31,0)","v":0},{"$f":"+D16*IFERROR('Proyecciones Base'!E31/'Proyecciones Base'!D31,0)","v":0},{"$f":"+E16*IFERROR('Proyecciones Base'!F31/'Proyecciones Base'!E31,0)","v":0},{"$f":"+F16*IFERROR('Proyecciones Base'!G31/'Proyecciones Base'!F31,0)","v":0},{"$f":"+G16*IFERROR('Proyecciones Base'!H31/'Proyecciones Base'!G31,0)","v":0}]
[null,"Cobertura AP",{"$f":"+Indicadores!D9","v":0},{"$f":"+'Proyecciones Base'!D36","v":0},{"$f":"+'Proyecciones Base'!E36","v":0},{"$f":"+'Proyecciones Base'!F36","v":0},{"$f":"+'Proyecciones Base'!G36","v":0},{"$f":"+'Proyecciones Base'!H36","v":0}]
[null,"Cobertura AR",{"$f":"+Indicadores!D10","v":0}]
[null,"Eficiencia Comercial",{"$f":"+Indicadores!D38","v":0},{"$f":"+'Proyecciones Base'!D37","v":0},{"$f":"+'Proyecciones Base'!E37","v":0},{"$f":"+'Proyecciones Base'!F37","v":0},{"$f":"+'Proyecciones Base'!G37","v":0},{"$f":"+'Proyecciones Base'!H37","v":0}]
[null,"Eficiencia Física",{"$f":"+Indicadores!D64","v":0},{"$f":"+'Proyecciones Base'!D38","v":0},{"$f":"+'Proyecciones Base'!E38","v":0},{"$f":"+'Proyecciones Base'!F38","v":0},{"$f":"+'Proyecciones Base'!G38","v":0},{"$f":"+'Proyecciones Base'!H38","v":0}]
[null,"% Micromedición",{"$f":"IFERROR(Datos!E23/Datos!E12,0)","v":0},{"$f":"+'Proyecciones Base'!D35","v":0},{"$f":"+'Proyecciones Base'!E35","v":0},{"$f":"+'Proyecciones Base'!F35","v":0},{"$f":"+'Proyecciones Base'!G35","v":0},{"$f":"+'Proyecciones Base'!H35","v":0}]
[null,"M3 producidos",{"$f":"+'Proyecciones Base'!C41","v":0},{"$f":"+'Proyecciones Base'!D41","v":0},{"$f":"+'Proyecciones Base'!E41","v":0},{"$f":"+'Proyecciones Base'!F41","v":0},{"$f":"+'Proyecciones Base'!G41","v":0},{"$f":"+'Proyecciones Base'!H41","v":0}]
[]
[null,"FACTURACION"]
[null,"DERECHOS"]
[null,"Agua Potable, Alcantarillado y Saneamiento",{"$f":"+Datos!E56+Datos!E57+Datos!E55","v":0},{"$f":"+'Proyecciones Base'!D40","v":0},{"$f":"+'Proyecciones Base'!E40","v":0},{"$f":"+'Proyecciones Base'!F40","v":0},{"$f":"+'Proyecciones Base'!G40","v":0},{"$f":"+'Proyecciones Base'!H40","v":0}]
[]
[null,"OTROS INGRESOS"]
[null,"Derecho de Conexión",{"$f":"+Facturacion!P8+Facturacion!P9","v":0},{"$f":"IFERROR(C29*D10/C10,0)","v":0},{"$f":"IFERROR(D29*E10/D10,0)","v":0},{"$f":"IFERROR(E29*F10/E10,0)","v":0},{"$f":"IFERROR(F29*G10/F10,0)","v":0},{"$f":"IFERROR(G29*H10/G10,0)","v":0}]
[null,"Otros ingresos",{"$f":"+Facturacion!P11+Facturacion!P10","v":0},{"$f":"IFERROR(C30*D10/C10,0)","v":0},{"$f":"IFERROR(D30*E10/D10,0)","v":0},{"$f":"IFERROR(E30*F10/E10,0)","v":0},{"$f":"IFERROR(F30*G10/F10,0)","v":0},{"$f":"IFERROR(G30*H10/G10,0)","v":0}]
[]
[null,"TOTAL DE INGRESOS",{"$f":"+C26*C19+C29+C30","v":0},0,0,0,0,0]
[]
[null,"EGRESOS"]
[null,"OPERACIÓN"]
[null,{"$f":"+Costos!B30","v":"Sueldos y Prestaciones"},{"$f":"+Costos!C30","v":0},{"$f":"+'Proyecciones Base'!D42*12","v":0},{"$f":"+'Proyecciones Base'!E42*12","v":0},{"$f":"+'Proyecciones Base'!F42*12","v":0},{"$f":"+'Proyecciones Base'!G42*12","v":0},{"$f":"+'Proyecciones Base'!H42*12","v":0}]
[null,{"$f":"+Costos!B31","v":"Energía Eléctrica"},{"$f":"+Costos!C31","v":0},{"$f":"IFERROR(C37*D22/C22,0)","v":0},{"$f":"IFERROR(D37*E22/D22,0)","v":0},{"$f":"IFERROR(E37*F22/E22,0)","v":0},{"$f":"IFERROR(F37*G22/F22,0)","v":0},{"$f":"IFERROR(G37*H22/G22,0)","v":0}]
[null,{"$f":"+Costos!B32","v":"Materiales"},{"$f":"+Costos!C32","v":0}]
[null,{"$f":"+Costos!B33","v":"Pago de Derechos"},{"$f":"+Costos!C33","v":0},{"$f":"IFERROR(C39*D22/C22,0)","v":0},{"$f":"IFERROR(D39*E22/D22,0)","v":0},{"$f":"IFERROR(E39*F22/E22,0)","v":0},{"$f":"IFERROR(F39*G22/F22,0)","v":0},{"$f":"IFERROR(G39*H22/G22,0)","v":0}]
[null,{"$f":"+Costos!B34","v":"Otros gastos operacionales"},{"$f":"+Costos!C34","v":0}]
[null,{"$f":"+Costos!B35","v":"Cloro y Reactivos"},{"$f":"+Costos!C35","v":0},{"$f":"IFERROR(C41*D22/C22,0)","v":0},{"$f":"IFERROR(D41*E22/D22,0)","v":0},{"$f":"IFERROR(E41*F22/E22,0)","v":0},{"$f":"IFERROR(F41*G22/F22,0)","v":0},{"$f":"IFERROR(G41*H22/G22,0)","v":0}]
[null,{"$f":"+Costos!B37","v":"Gastos No operacionales"},{"$f":"+MAX(Costos!C37-Costos!C24-Costos!C22,0)","v":0}]
[]
[null,"GASTOS ADICIONALES PRODI",null,{"$f":"+'Detalle evaluacion'!X117*1000000","v":0},{"$f":"+'Detalle evaluacion'!Y117*1000000","v":0},{"$f":"+'Detalle evaluacion'!Z117*1000000","v":0},{"$f":"+'Detalle evaluacion'!AA117*1000000","v":0},{"$f":"+'Detalle evaluacion'!AB117*1000000","v":0}]
[]
[null,"TOTAL DE EGRESOS",{"$f":"+SUM(C36:C44)","v":0},0,0,0,0,0]
[]
[null,"SALDO DE CAJA OPERACIONAL (EBITDA)",{"$f":"+C32-C46","v":0},0,0,0,0,0]
[]
[null,"PAGO CREDITOS",{"$f":"+Datos!E50","v":0},{"$f":"+SUMIF(Costos!$L$9:$L$15,\">=1\",Costos!$J$9:$J$15)+SUMIF(Costos!$L$9:$L$15,\">=1\",Costos!$K$9:$K$15)","v":0},{"$f":"+SUMIF(Costos!$L$9:$L$15,\">=2\",Costos!$J$9:$J$15)+SUMIF(Costos!$L$9:$L$15,\">=2\",Costos!$K$9:$K$15)","v":0},{"$f":"+SUMIF(Costos!$L$9:$L$15,\">=3\",Costos!$J$9:$J$15)+SUMIF(Costos!$L$9:$L$15,\">=3\",Costos!$K$9:$K$15)","v":0},{"$f":"+SUMIF(Costos!$L$9:$L$15,\">=4\",Costos!$J$9:$J$15)+SUMIF(Costos!$L$9:$L$15,\">=4\",Costos!$K$9:$K$15)","v":0},{"$f":"+SUMIF(Costos!$L$9:$L$15,\">=5\",Costos!$J$9:$J$15)+SUMIF(Costos!$L$9:$L$15,\">=5\",Costos!$K$9:$K$15)","v":0}]
[]
[null,"INVERSIONES PRODI",null,{"$f":"IFERROR(HLOOKUP(D7,Calendarizacion!$C$66:$G$121,56),0)","v":0},{"$f":"IFERROR(HLOOKUP(E7,Calendarizacion!$C$66:$G$121,56),0)","v":0},{"$f":"IFERROR(HLOOKUP(F7,Calendarizacion!$C$66:$G$121,56),0)","v":0},{"$f":"IFERROR(HLOOKUP(G7,Calendarizacion!$C$66:$G$121,56),0)","v":0},{"$f":"IFERROR(HLOOKUP(H7,Calendarizacion!$C$66:$G$121,56),0)","v":0}]
[null,"INVERSIONES EN FINANCIAMIENTO PRODI",null,0,0,0,0,0]
[null,"Reposición anual",{"$f":"+Indicadores!D96","v":0},{"$f":"IFERROR(C54*D10/C10,0)","v":0},{"$f":"IFERROR(D54*E10/D10,0)","v":0},{"$f":"IFERROR(E54*F10/E10,0)","v":0},{"$f":"IFERROR(F54*G10/F10,0)","v":0},{"$f":"IFERROR(G54*H10/G10,0)","v":0}]
[null,"Inversión por crecimiento",{"$f":"+Indicadores!D97","v":0},{"$f":"IFERROR(C55*D10/C10,0)","v":0},{"$f":"IFERROR(D55*E10/D10,0)","v":0},{"$f":"IFERROR(E55*F10/E10,0)","v":0},{"$f":"IFERROR(F55*G10/F10,0)","v":0},{"$f":"IFERROR(G55*H10/G10,0)","v":0}]
[]
[null,"SALDO DE CAJA DESPUES DE INVERSIONES",{"$f":"+C48-C52-C50-C54-C55-C53","v":0},0,0,0,0,0]
[]
[null,"SALDO DE CAJA ACUMULADO DESPUES DE INVERSIONES",null,{"$f":"+D57","v":0},{"$f":"+D59+E57","v":0},{"$f":"+E59+F57","v":0},{"$f":"+F59+G57","v":0},{"$f":"+G59+H57","v":0}]
[]
[null,"FINANCIAMIENTO",null,{"$f":"+IF(D57<0,-D57,0)","v":0},{"$f":"+IF(E57<0,-E57,0)","v":0},{"$f":"+IF(F57<0,-F57,0)","v":0},{"$f":"+IF(G57<0,-G57,0)","v":0},{"$f":"+IF(H57<0,-H57,0)","v":0}]
[]
[null,"Repago Financiamiento",null,null,{"$f":"SUM($D61:D61)/10","v":0},{"$f":"SUM($D61:E61)/10","v":0},{"$f":"SUM($D61:F61)/10","v":0},{"$f":"SUM($D61:G61)/10","v":0}]
[]
[null,"SALDO DE CAJA DESPUES DE FINANCIAMIENTO",null,{"$f":"+D61+D57-D63","v":0},{"$f":"+E61+E57-E63","v":0},{"$f":"+F61+F57-F63","v":0},{"$f":"+G61+G57-G63","v":0},{"$f":"+H61+H57-H63","v":0}]
[]
[null,"SALDO DE CAJA ACUMULADO DESPUES DE FINANCIAMIENTO",null,{"$f":"+C67+D65","v":0},{"$f":"+D67+E65","v":0},{"$f":"+E67+F65","v":0},{"$f":"+F67+G65","v":0},{"$f":"+G67+H65","v":0}]
[]
[null,"NOTAS:"]
[]
[]
[]
[]
[]
[]
[]
[]
[]
[]
[]
[]
[]
[]
[]
[]
[]
[]
[]
[]
[]
[]
[]
[]
[]
[]
[]
[]
[]
[]
[null,null,null,{"$f":"IFERROR(HLOOKUP(D7,Calendarizacion!$C$66:$G$121,52),0)","v":0},{"$f":"IFERROR(HLOOKUP(E7,Calendarizacion!$C$66:$G$121,52),0)","v":0},{"$f":"IFERROR(HLOOKUP(F7,Calendarizacion!$C$66:$G$121,52),0)","v":0},{"$f":"IFERROR(HLOOKUP(G7,Calendarizacion!$C$66:$G$121,52),0)","v":0},{"$f":"IFERROR(HLOOKUP(H7,Calendarizacion!$C$66:$G$121,52),0)","v":0}]

{"sheet":"Practicas","index":7,"n_rows":29,"n_cols":5,"rows_kept":29,"cut":false,"hidden":false,"merged":[[1,1,1,2],[28,2,38,6],[3,2,3,4],[4,2,4,4]]}
[]
[null,"Formato 5. PRACTICAS DE GESTION"]
[]
[null,"NOMBRE:",{"$f":"+Datos!C4","v":"X"}]
[null,"AÑO:",{"$f":"+Datos!C5","v":0}]
[]
[null,"PRACTICA","SÍ/NO","TIPO","COMENTARIOS"]
[null,"El organismo operador cuenta con un consejo de administración",null,"estructural"]
[null,"El control del consejo de administración está en manos de los representantes de la sociedad civil",null,"estructural"]
[null,"El consejo de administración y/o el director general del organismo tienen \"autonomía empresarial\" en temas relacionados con la fijación de remuneraciones y dotación de personal.",null,"estructural"]
[null,"El consejo de administración y/o el director general del organismo tienen \"autonomía empresarial\" para fijar las tarifas por los servicios que presta el organismo.",null,"estructural"]
[null,"Las tarifas por los servicios que presta el organismo son actualizadas anualmente (por medio de indexación o algún proceso de revisión continua) ",null,"estructural"]
[null,"El organismo tiene un sistema de contabilidad estandarizado y sistematizado",null,"gestión"]
[null,"El organismo divulga sus estados financieros a través de Internet",null,"gestión"]
[null,"El organismo divulga las tarifas por los servicios que presta a través de Internet",null,"gestión"]
[null,"Existe un proceso de planeación integral y continuo con metas e indicadores a los que se da seguimiento",null,"gestión"]
[null,"Existe un proceso continuo de elaboración y evaluación de proyectos del organismo",null,"gestión"]
[null,"Se permite el corte de agua a usuarios domésticos por no pago del servicio"]
[null,"El ciclo de facturación es mensual, bimestral, semestral o anual"]
[null,"Se cuenta con un Sistema de Información Geográfica",null,"gestión"]
[null,"Se cuenta con catastro de redes",null,"gestión"]
[null,"Se ejecutan procedimientos para actualizar el catastro de redes",null,"gestión"]
[null,"Se cuenta con sectorización hidráulica confiable",null,"estructural"]
[null,"Grado de dificultad en la obtención de la información comercial (1 a 10)"]
[]
[null,"Total de prácticas evaluadas",{"$f":"SUBTOTAL(103,C8:C24)","v":0}]
[]
[]
[null,"NOTAS:"]

{"sheet":"PobAtendida","index":8,"n_rows":30,"n_cols":9,"rows_kept":30,"cut":false,"hidden":false,"merged":[[1,1,1,3],[29,2,39,7],[3,2,3,7],[4,2,4,7]]}
[]
[null,"Formato 6. POBLACION ATENDIDA"]
[]
[null,"NOMBRE:",{"$f":"+Datos!C4","v":"X"}]
[null,"AÑO:",{"$f":"+Datos!C5","v":0}]
[]
[null,"Número","Nombre de la localidad","Población CONAPO/INEGI (habitantes)","Porcentaje de la localidad que debe ser atendida por el Organismo (%)","Porcentaje de la localidad atendida por otros Organismos (%)","Población que debe ser atendida por el Organismo","Población atendida por otros prestadores","Población sin cobertura"]
[null,null,null,null,null,null,{"$f":"INT(D8*E8)","v":0},{"$f":"INT(D8*F8)","v":0},{"$f":"+Tabla5[[#This Row],[Población CONAPO/INEGI (habitantes)]]-Tabla5[[#This Row],[Población que debe ser atendida por el Organismo]]-Tabla5[[#This Row],[Población atendida por otros prestadores]]","v":0}]
[null,null,null,null,null,null,0,0,{"$f":"+Tabla5[[#This Row],[Población CONAPO/INEGI (habitantes)]]-Tabla5[[#This Row],[Población que debe ser atendida por el Organismo]]-Tabla5[[#This Row],[Población atendida por otros prestadores]]","v":0}]
[null,null,null,null,null,null,0,0,{"$f":"+Tabla5[[#This Row],[Población CONAPO/INEGI (habitantes)]]-Tabla5[[#This Row],[Población que debe ser atendida por el Organismo]]-Tabla5[[#This Row],[Población atendida por otros prestadores]]","v":0}]
[null,null,null,null,null,null,0,0,{"$f":"+Tabla5[[#This Row],[Población CONAPO/INEGI (habitantes)]]-Tabla5[[#This Row],[Población que debe ser atendida por el Organismo]]-Tabla5[[#This Row],[Población atendida por otros prestadores]]","v":0}]
[null,null,null,null,null,null,0,0,{"$f":"+Tabla5[[#This Row],[Población CONAPO/INEGI (habitantes)]]-Tabla5[[#This Row],[Población que debe ser atendida por el Organismo]]-Tabla5[[#This Row],[Población atendida por otros prestadores]]","v":0}]
[null,null,null,null,null,null,0,0,{"$f":"+Tabla5[[#This Row],[Población CONAPO/INEGI (habitantes)]]-Tabla5[[#This Row],[Población que debe ser atendida por el Organismo]]-Tabla5[[#This Row],[Población atendida por otros prestadores]]","v":0}]
[null,null,null,null,null,null,0,0,{"$f":"+Tabla5[[#This Row],[Población CONAPO/INEGI (habitantes)]]-Tabla5[[#This Row],[Población que debe ser atendida por el Organismo]]-Tabla5[[#This Row],[Población atendida por otros prestadores]]","v":0}]
[null,null,null,null,null,null,0,0,{"$f":"+Tabla5[[#This Row],[Población CONAPO/INEGI (habitantes)]]-Tabla5[[#This Row],[Población que debe ser atendida por el Organismo]]-Tabla5[[#This Row],[Población atendida por otros prestadores]]","v":0}]
[null,null,null,null,null,null,0,0,{"$f":"+Tabla5[[#This Row],[Población CONAPO/INEGI (habitantes)]]-Tabla5[[#This Row],[Población que debe ser atendida por el Organismo]]-Tabla5[[#This Row],[Población atendida por otros prestadores]]","v":0}]
[null,null,null,null,null,null,0,0,{"$f":"+Tabla5[[#This Row],[Población CONAPO/INEGI (habitantes)]]-Tabla5[[#This Row],[Población que debe ser atendida por el Organismo]]-Tabla5[[#This Row],[Población atendida por otros prestadores]]","v":0}]
[null,null,null,null,null,null,0,0,{"$f":"+Tabla5[[#This Row],[Población CONAPO/INEGI (habitantes)]]-Tabla5[[#This Row],[Población que debe ser atendida por el Organismo]]-Tabla5[[#This Row],[Población atendida por otros prestadores]]","v":0}]
[null,null,null,null,null,null,0,0,{"$f":"+Tabla5[[#This Row],[Población CONAPO/INEGI (habitantes)]]-Tabla5[[#This Row],[Población que debe ser atendida por el Organismo]]-Tabla5[[#This Row],[Población atendida por otros prestadores]]","v":0}]
[null,null,null,null,null,null,0,0,{"$f":"+Tabla5[[#This Row],[Población CONAPO/INEGI (habitantes)]]-Tabla5[[#This Row],[Población que debe ser atendida por el Organismo]]-Tabla5[[#This Row],[Población atendida por otros prestadores]]","v":0}]
[null,null,null,{"$f":"SUBTOTAL(109,Tabla5[Población CONAPO/INEGI (habitantes)])","v":0},null,null,{"$f":"SUBTOTAL(109,Tabla5[Población que debe ser atendida por el Organismo])","v":0},{"$f":"SUBTOTAL(109,Tabla5[Población atendida por otros prestadores])","v":0},{"$f":"SUM(Tabla5[Población sin cobertura])","v":0}]
[]
[null,"Número de localidades atendidas:",null,{"$f":"COUNTA(C8:C20)","v":0}]
[]
[null,"Instrucciones de llenado:"]
[null,"Relacionar todas aquellas localidades a las que atiende el organismo operador incluso si éstas están en otro municipio."]
[null,"Para áquellas localidades a las que solo se brinde asistencia técnica poner una nota aclarando dicha situación."]
[]
[]
[null,"NOTAS:"]

{"sheet":"Produccion","index":9,"n_rows":172,"n_cols":16,"rows_kept":172,"cut":false,"hidden":false,"merged":[[153,4,153,5],[153,7,153,8],[154,4,154,5],[154,7,154,8],[155,4,155,5],[155,7,155,8],[156,4,156,5],[156,7,156,8],[157,4,157,5],[157,7,157,8],[148,4,148,5],[148,7,148,8],[149,4,149,5],[149,7,149,8],[150,4,150,5],[150,7,150,8],[151,4,151,5],[151,7,151,8],[152,4,152,5],[152,7,152,8],[143,4,143,5],[143,7,143,8],[144,4,144,5],[144,7,144,8],[145,4,145,5],[145,7,145,8],[146,4,146,5],[146,7,146,8],[147,4,147,5],[147,7,147,8],[138,4,138,5],[138,7,138,8],[139,4,139,5],[139,7,139,8],[140,4,140,5],[140,7,140,8],[141,4,141,5],[141,7,141,8],[142,4,142,5],[142,7,142,8],[133,4,133,5],[133,7,133,8],[134,4,134,5],[134,7,134,8],[135,4,135,5],[135,7,135,8],[136,4,136,5],[136,7,136,8],[137,4,137,5],[137,7,137,8],[128,4,128,5],[128,7,128,8],[129,4,129,5],[129,7,129,8],[130,4,130,5],[130,7,130,8],[131,4,131,5],[131,7,131,8],[132,4,132,5],[132,7,132,8],[123,4,123,5],[123,7,123,8],[124,4,124,5],[124,7,124,8],[125,4,125,5],[125,7,125,8],[126,4,126,5],[126,7,126,8],[127,4,127,5],[127,7,127,8],[118,4,118,5],[118,7,118,8],[119,4,119,5],[119,7,119,8],[120,4,120,5],[120,7,120,8],[121,4,121,5],[121,7,121,8],[122,4,122,5],[122,7,122,8],[113,4,113,5],[113,7,113,8],[114,4,114,5],[114,7,114,8],[115,4,115,5],[115,7,115,8],[116,4,116,5],[116,7,116,8],[117,4,117,5],[117,7,117,8],[108,4,108,5],[108,7,108,8],[109,4,109,5],[109,7,109,8],[110,4,110,5],[110,7,110,8],[111,4,111,5],[111,7,111,8],[112,4,112,5],[112,7,112,8],[103,4,103,5],[103,7,103,8],[104,4,104,5],[104,7,104,8],[105,4,105,5],[105,7,105,8],[106,4,106,5],[106,7,106,8],[107,4,107,5],[107,7,107,8],[98,4,98,5],[98,7,98,8],[99,4,99,5],[99,7,99,8],[100,4,100,5],[100,7,100,8],[101,4,101,5],[101,7,101,8],[102,4,102,5],[102,7,102,8],[93,4,93,5],[93,7,93,8],[94,4,94,5],[94,7,94,8],[95,4,95,5],[95,7,95,8],[96,4,96,5],[96,7,96,8],[97,4,97,5],[97,7,97,8],[88,4,88,5],[88,7,88,8],[89,4,89,5],[89,7,89,8],[90,4,90,5],[90,7,90,8],[91,4,91,5],[91,7,91,8],[92,4,92,5],[92,7,92,8],[83,4,83,5],[83,7,83,8],[84,4,84,5],[84,7,84,8],[85,4,85,5],[85,7,85,8],[86,4,86,5],[86,7,86,8],[87,4,87,5],[87,7,87,8],[78,4,78,5],[78,7,78,8],[79,4,79,5],[79,7,79,8],[80,4,80,5],[80,7,80,8],[81,4,81,5],[81,7,81,8],[82,4,82,5],[82,7,82,8],[73,4,73,5],[73,7,73,8],[74,4,74,5],[74,7,74,8],[75,4,75,5],[75,7,75,8],[76,4,76,5],[76,7,76,8],[77,4,77,5],[77,7,77,8],[68,4,68,5],[68,7,68,8],[69,4,69,5],[69,7,69,8],[70,4,70,5],[70,7,70,8],[71,4,71,5],[71,7,71,8],[72,4,72,5],[72,7,72,8],[63,4,63,5],[63,7,63,8],[64,4,64,5],[64,7,64,8],[65,4,65,5],[65,7,65,8],[66,4,66,5],[66,7,66,8],[67,4,67,5],[67,7,67,8],[58,4,58,5],[58,7,58,8],[59,4,59,5],[59,7,59,8],[60,4,60,5],[60,7,60,8],[61,4,61,5],[61,7,61,8],[62,4,62,5],[62,7,62,8],[42,7,42,8],[43,7,43,8],[44,7,44,8],[37,7,37,8],[38,7,38,8],[39,7,39,8],[40,7,40,8],[41,7,41,8],[32,7,32,8],[33,7,33,8],[34,7,34,8],[35,7,35,8],[36,7,36,8],[27,7,27,8],[28,7,28,8],[29,7,29,8],[30,7,30,8],[31,7,31,8],[22,7,22,8],[23,7,23,8],[24,7,24,8],[25,7,25,8],[26,7,26,8],[41,4,41,5],[42,4,42,5],[43,4,43,5],[44,4,44,5],[10,7,10,8],[11,7,11,8],[12,7,12,8],[13,7,13,8],[14,7,14,8],[15,7,15,8],[16,7,16,8],[17,7,17,8],[18,7,18,8],[19,7,19,8],[20,7,20,8],[21,7,21,8],[36,4,36,5],[37,4,37,5],[38,4,38,5],[39,4,39,5],[40,4,40,5],[31,4,31,5],[32,4,32,5],[33,4,33,5],[6,15,7,15],[6,3,7,3],[6,9,7,9],[1,1,1,3],[171,2,181,6],[6,12,7,12],[6,10,7,10],[6,11,7,11],[168,1,168,15],[6,5,7,5],[6,13,7,13],[6,14,7,14],[6,4,7,4],[6,7,6,8],[6,1,7,1],[6,2,7,2],[8,7,8,8],[9,7,9,8],[45,7,45,8],[46,7,46,8],[47,7,47,8],[48,7,48,8],[49,7,49,8],[17,4,17,5],[57,7,57,8],[8,4,8,5],[9,4,9,5],[45,4,45,5],[46,4,46,5],[47,4,47,5],[48,4,48,5],[49,4,49,5],[50,4,50,5],[51,4,51,5],[52,4,52,5],[53,4,53,5],[54,4,54,5],[55,4,55,5],[56,4,56,5],[57,4,57,5],[16,4,16,5],[18,4,18,5],[19,4,19,5],[20,4,20,5],[15,4,15,5],[10,4,10,5],[11,4,11,5],[12,4,12,5],[3,2,3,11],[4,2,4,11],[50,7,50,8],[51,7,51,8],[52,7,52,8],[53,7,53,8],[54,7,54,8],[55,7,55,8],[56,7,56,8],[6,6,7,6],[13,4,13,5],[14,4,14,5],[34,4,34,5],[35,4,35,5],[26,4,26,5],[27,4,27,5],[28,4,28,5],[29,4,29,5],[30,4,30,5],[21,4,21,5],[22,4,22,5],[23,4,23,5],[24,4,24,5],[25,4,25,5]]}
[]
[null,"Formato 7. PRODUCCION POR FUENTE"]
[]
[null,"NOMBRE:",{"$f":"+Datos!C4","v":"X"}]
[null,"AÑO:",{"$f":"+Datos!C5","v":0}]
[]
[null,"Número","Nombre de la captación","Tipo de fuente","Subterránea","Superficial","Capacidad instalada      (lps)","Fuente con macromedidor instalado funcionando",null,"Longitud de la conducción      km","Horas de bombeo (Producción) promedio al día","Días de funcionamiento al año","Volumen anual macromedido m3","Producción anual de agua subterránea    m3","Producción anual de agua superficial            m3","Producción Anual                 m3"]
[null,null,null,null,"Subterránea",null,null,"SI","NO",null,"*","*"]
[null,1,null,null,null,null,null,null,null,null,null,null,{"$f":"IF(H9=\"SI\",P9,0)","v":0},{"$f":"IF(E9=\"Subterránea\",P9,0)","v":0},{"$f":"IF(E9=\"Superficial\",P9,0)","v":0},{"$f":"3.6*G9*K9*L9","v":0}]
[null,{"$f":"1+B9","v":2},null,null,null,null,null,null,null,null,null,null,{"$f":"IF(H10=\"SI\",P10,0)","v":0},{"$f":"IF(E10=\"Subterránea\",P10,0)","v":0},{"$f":"IF(E10=\"Superficial\",P10,0)","v":0},{"$f":"3.6*G10*K10*L10","v":0}]
[null,{"$f":"1+B10","v":3},null,null,null,null,null,null,null,null,null,null,0,{"$f":"IF(E11=\"Subterránea\",P11,0)","v":0},{"$f":"IF(E11=\"Superficial\",P11,0)","v":0},{"$f":"3.6*G11*K11*L11","v":0}]
[null,4,null,null,null,null,null,null,null,null,null,null,0,0,0,0]
[null,5,null,null,null,null,null,null,null,null,null,null,0,0,0,0]
[null,6,null,null,null,null,null,null,null,null,null,null,0,0,0,0]
[null,7,null,null,null,null,null,null,null,null,null,null,0,0,0,0]
[null,8,null,null,null,null,null,null,null,null,null,null,0,0,0,0]
[null,9,null,null,null,null,null,null,null,null,null,null,0,0,0,0]
[null,10,null,null,null,null,null,null,null,null,null,null,0,0,0,0]
[null,11,null,null,null,null,null,null,null,null,null,null,0,0,0,0]
[null,12,null,null,null,null,null,null,null,null,null,null,0,0,0,0]
[null,13,null,null,null,null,null,null,null,null,null,null,0,0,0,0]
[null,14,null,null,null,null,null,null,null,null,null,null,0,0,0,0]
[null,15,null,null,null,null,null,null,null,null,null,null,0,0,0,0]
[null,16,null,null,null,null,null,null,null,null,null,null,0,0,0,0]
[null,17,null,null,null,null,null,null,null,null,null,null,0,0,0,0]
[null,18,null,null,null,null,null,null,null,null,null,null,0,0,0,0]
[null,19,null,null,null,null,null,null,null,null,null,null,0,0,0,0]
[null,20,null,null,null,null,null,null,null,null,null,null,0,0,0,0]
[null,21,null,null,null,null,null,null,null,null,null,null,0,0,0,0]
[null,22,null,null,null,null,null,null,null,null,null,null,0,0,0,0]
[null,23,null,null,null,null,null,null,null,null,null,null,0,0,0,0]
[null,24,null,null,null,null,null,null,null,null,null,null,0,0,0,0]
[null,25,null,null,null,null,null,null,null,null,null,null,0,0,0,0]
[null,26,null,null,null,null,null,null,null,null,null,null,0,0,0,0]
[null,27,null,null,null,null,null,null,null,null,null,null,0,0,0,0]
[null,28,null,null,null,null,null,null,null,null,null,null,0,0,0,0]
[null,29,null,null,null,null,null,null,null,null,null,null,0,0,0,0]
[null,30,null,null,null,null,null,null,null,null,null,null,0,0,0,0]
[null,31,null,null,null,null,null,null,null,null,null,null,0,0,0,0]
[null,32,null,null,null,null,null,null,null,null,null,null,0,0,0,0]
[null,33,null,null,null,null,null,null,null,null,null,null,0,0,0,0]
[null,34,null,null,null,null,null,null,null,null,null,null,0,0,0,0]
[null,35,null,null,null,null,null,null,null,null,null,null,0,0,0,0]
[null,36,null,null,null,null,null,null,null,null,null,null,0,0,0,0]
[null,37,null,null,null,null,null,null,null,null,null,null,0,0,0,0]
[null,38,null,null,null,null,null,null,null,null,null,null,0,{"$f":"IF(E46=\"Subterránea\",P46,0)","v":0},{"$f":"IF(E46=\"Superficial\",P46,0)","v":0},{"$f":"3.6*G46*K46*L46","v":0}]
[null,39,null,null,null,null,null,null,null,null,null,null,0,0,0,0]
[null,40,null,null,null,null,null,null,null,null,null,null,0,0,0,0]
[null,41,null,null,null,null,null,null,null,null,null,null,0,0,0,0]
[null,42,null,null,null,null,null,null,null,null,null,null,0,0,0,0]
[null,43,null,null,null,null,null,null,null,null,null,null,0,0,0,0]
[null,44,null,null,null,null,null,null,null,null,null,null,0,0,0,0]
[null,45,null,null,null,null,null,null,null,null,null,null,0,0,0,0]
[null,46,null,null,null,null,null,null,null,null,null,null,0,0,0,0]
[null,47,null,null,null,null,null,null,null,null,null,null,0,0,0,0]
[null,48,null,null,null,null,null,null,null,null,null,null,0,0,0,0]
[null,49,null,null,null,null,null,null,null,null,null,null,0,0,0,0]
[null,50,null,null,null,null,null,null,null,null,null,null,0,0,0,0]
[null,51,null,null,null,null,null,null,null,null,null,null,{"$f":"IF(H59=\"SI\",P59,0)","v":0},0,0,0]
[null,52,null,null,null,null,null,null,null,null,null,null,{"$f":"IF(H60=\"SI\",P60,0)","v":0},{"$f":"IF(E60=\"Subterránea\",P60,0)","v":0},{"$f":"IF(E60=\"Superficial\",P60,0)","v":0},{"$f":"3.6*G60*K60*L60","v":0}]
[null,53,null,null,null,null,null,null,null,null,null,null,0,0,0,0]
[null,54,null,null,null,null,null,null,null,null,null,null,0,0,0,0]
[null,55,null,null,null,null,null,null,null,null,null,null,0,0,0,0]
[null,56,null,null,null,null,null,null,null,null,null,null,0,0,0,0]
[null,57,null,null,null,null,null,null,null,null,null,null,0,0,0,0]
[null,58,null,null,null,null,null,null,null,null,null,null,0,0,0,0]
[null,59,null,null,null,null,null,null,null,null,null,null,0,0,0,0]
[null,60,null,null,null,null,null,null,null,null,null,null,0,0,0,0]
[null,61,null,null,null,null,null,null,null,null,null,null,0,0,0,0]
[null,62,null,null,null,null,null,null,null,null,null,null,0,0,0,0]
[null,63,null,null,null,null,null,null,null,null,null,null,0,0,0,0]
[null,64,null,null,null,null,null,null,null,null,null,null,0,0,0,0]
[null,65,null,null,null,null,null,null,null,null,null,null,0,0,0,0]
[null,66,null,null,null,null,null,null,null,null,null,null,0,0,0,0]
[null,{"$f":"1+B74","v":67},null,null,null,null,null,null,null,null,null,null,0,0,0,0]
[null,68,null,null,null,null,null,null,null,null,null,null,0,0,0,0]
[null,69,null,null,null,null,null,null,null,null,null,null,0,0,0,0]
[null,70,null,null,null,null,null,null,null,null,null,null,0,0,0,0]
[null,71,null,null,null,null,null,null,null,null,null,null,0,0,0,0]
[null,72,null,null,null,null,null,null,null,null,null,null,0,0,0,0]
[null,73,null,null,null,null,null,null,null,null,null,null,0,0,0,0]
[null,74,null,null,null,null,null,null,null,null,null,null,0,0,0,0]
[null,75,null,null,null,null,null,null,null,null,null,null,0,0,0,0]
[null,76,null,null,null,null,null,null,null,null,null,null,0,0,0,0]
[null,77,null,null,null,null,null,null,null,null,null,null,0,0,0,0]
[null,78,null,null,null,null,null,null,null,null,null,null,{"$f":"IF(H86=\"SI\",P86,0)","v":0},{"$f":"IF(E86=\"Subterránea\",P86,0)","v":0},{"$f":"IF(E86=\"Superficial\",P86,0)","v":0},{"$f":"3.6*G86*K86*L86","v":0}]
[null,79,null,null,null,null,null,null,null,null,null,null,0,0,0,0]
[null,80,null,null,null,null,null,null,null,null,null,null,0,0,0,0]
[null,81,null,null,null,null,null,null,null,null,null,null,0,0,0,0]
[null,82,null,null,null,null,null,null,null,null,null,null,0,0,0,0]
[null,83,null,null,null,null,null,null,null,null,null,null,0,0,0,0]
[null,84,null,null,null,null,null,null,null,null,null,null,0,0,0,0]
[null,85,null,null,null,null,null,null,null,null,null,null,0,0,0,0]
[null,86,null,null,null,null,null,null,null,null,null,null,0,0,0,0]
[null,87,null,null,null,null,null,null,null,null,null,null,0,0,0,0]
[null,88,null,null,null,null,null,null,null,null,null,null,0,0,0,0]
[null,89,null,null,null,null,null,null,null,null,null,null,0,0,0,0]
[null,90,null,null,null,null,null,null,null,null,null,null,0,0,0,0]
[null,91,null,null,null,null,null,null,null,null,null,null,0,0,0,0]
[null,92,null,null,null,null,null,null,null,null,null,null,0,0,0,0]
[null,93,null,null,null,null,null,null,null,null,null,null,0,0,0,0]
[null,94,null,null,null,null,null,null,null,null,null,null,0,0,0,0]
[null,95,null,null,null,null,null,null,null,null,null,null,0,0,0,0]
[null,96,null,null,null,null,null,null,null,null,null,null,0,0,0,0]
[null,97,null,null,null,null,null,null,null,null,null,null,0,0,0,0]
[null,98,null,null,null,null,null,null,null,null,null,null,0,0,0,0]
[null,99,null,null,null,null,null,null,null,null,null,null,0,0,0,0]
[null,100,null,null,null,null,null,null,null,null,null,null,0,0,0,0]
[null,101,null,null,null,null,null,null,null,null,null,null,{"$f":"IF(H109=\"SI\",P109,0)","v":0},{"$f":"IF(E109=\"Subterránea\",P109,0)","v":0},{"$f":"IF(E109=\"Superficial\",P109,0)","v":0},{"$f":"3.6*G109*K109*L109","v":0}]
[null,102,null,null,null,null,null,null,null,null,null,null,0,0,0,0]
[null,103,null,null,null,null,null,null,null,null,null,null,0,0,0,0]
[null,104,null,null,null,null,null,null,null,null,null,null,0,0,0,0]
[null,105,null,null,null,null,null,null,null,null,null,null,0,0,0,0]
[null,106,null,null,null,null,null,null,null,null,null,null,0,0,0,0]
[null,107,null,null,null,null,null,null,null,null,null,null,0,0,0,0]
[null,108,null,null,null,null,null,null,null,null,null,null,0,0,0,0]
[null,109,null,null,null,null,null,null,null,null,null,null,0,0,0,0]
[null,110,null,null,null,null,null,null,null,null,null,null,0,0,0,0]
[null,111,null,null,null,null,null,null,null,null,null,null,0,0,0,0]
[null,112,null,null,null,null,null,null,null,null,null,null,0,0,0,0]
[null,113,null,null,null,null,null,null,null,null,null,null,0,0,0,0]
[null,114,null,null,null,null,null,null,null,null,null,null,0,0,0,0]
[null,115,null,null,null,null,null,null,null,null,null,null,0,0,0,0]
[null,116,null,null,null,null,null,null,null,null,null,null,0,0,0,0]
[null,117,null,null,null,null,null,null,null,null,null,null,0,0,0,0]
[null,118,null,null,null,null,null,null,null,null,null,null,0,0,0,0]
[null,119,null,null,null,null,null,null,null,null,null,null,0,0,0,0]
[null,120,null,null,null,null,null,null,null,null,null,null,0,0,0,0]
[null,121,null,null,null,null,null,null,null,null,null,null,0,0,0,0]
[null,122,null,null,null,null,null,null,null,null,null,null,0,0,0,0]
[null,123,null,null,null,null,null,null,null,null,null,null,0,0,0,0]
[null,124,null,null,null,null,null,null,null,null,null,null,0,0,0,0]
[null,125,null,null,null,null,null,null,null,null,null,null,0,0,0,0]
[null,126,null,null,null,null,null,null,null,null,null,null,0,0,0,0]
[null,127,null,null,null,null,null,null,null,null,null,null,0,0,0,0]
[null,128,null,null,null,null,null,null,null,null,null,null,0,0,0,0]
[null,129,null,null,null,null,null,null,null,null,null,null,0,0,0,0]
[null,130,null,null,null,null,null,null,null,null,null,null,0,0,0,0]
[null,{"$f":"1+B138","v":131},null,null,null,null,null,null,null,null,null,null,0,0,0,0]
[null,132,null,null,null,null,null,null,null,null,null,null,0,0,0,0]
[null,133,null,null,null,null,null,null,null,null,null,null,0,0,0,0]
[null,134,null,null,null,null,null,null,null,null,null,null,0,0,0,0]
[null,135,null,null,null,null,null,null,null,null,null,null,0,0,0,0]
[null,136,null,null,null,null,null,null,null,null,null,null,0,0,0,0]
[null,137,null,null,null,null,null,null,null,null,null,null,0,0,0,0]
[null,138,null,null,null,null,null,null,null,null,null,null,0,0,0,0]
[null,139,null,null,null,null,null,null,null,null,null,null,0,0,0,0]
[null,140,null,null,null,null,null,null,null,null,null,null,0,0,0,0]
[null,141,null,null,null,null,null,null,null,null,null,null,0,0,0,0]
[null,142,null,null,null,null,null,null,null,null,null,null,0,0,0,0]
[null,143,null,null,null,null,null,null,null,null,null,null,0,0,0,0]
[null,144,null,null,null,null,null,null,null,null,null,null,0,0,0,0]
[null,145,null,null,null,null,null,null,null,null,null,null,0,0,0,0]
[null,146,null,null,null,null,null,null,null,null,null,null,0,0,0,0]
[null,147,null,null,null,null,null,null,null,null,null,null,0,0,0,0]
[null,148,null,null,null,null,null,null,null,null,null,null,0,0,0,0]
[null,149,null,null,null,null,null,null,null,null,null,null,0,0,0,0]
[null,150,null,null,null,null,null,null,null,null,null,null,{"$f":"IF(H158=\"SI\",P158,0)","v":0},{"$f":"IF(E158=\"Subterránea\",P158,0)","v":0},{"$f":"IF(E158=\"Superficial\",P158,0)","v":0},{"$f":"3.6*G158*K158*L158","v":0}]
[null,"TOTAL",{"$f":"150-COUNTIF(C9:C158,\"\")","v":0},null,{"$f":"+COUNTIF(E9:F158,\"Subterránea\")","v":0},{"$f":"+COUNTIF(E9:F158,\"Superficial\")","v":0},{"$f":"SUM(G9:G158)","v":0},{"$f":"COUNTIF(H9:H158,\"SI\")","v":0},{"$f":"COUNTIF(H9:H158,\"NO\")","v":0},{"$f":"+SUM(J9:J158)","v":0},null,null,{"$f":"SUM(M9:M158)","v":0},{"$f":"SUM(N9:N158)","v":0},{"$f":"SUM(O9:O158)","v":0},{"$f":"SUM(P9:P158)","v":0}]
[null,"Agua en bloque",{"$f":"COUNTIF(D9:D158,\"AB\")","v":0},null,{"$f":"+COUNTIFS(D9:D158,\"AB\",E9:E158,\"Subterránea\")","v":0},{"$f":"+COUNTIFS(D9:D158,\"AB\",E9:E158,\"Superficial\")","v":0},{"$f":"SUMIF(D9:D158,\"AB\",G9:G158)","v":0},{"$f":"+COUNTIFS(D9:D158,\"AB\",H9:H158,\"SI\")","v":0},{"$f":"COUNTIF(H9:H158,\"NO\")","v":0},{"$f":"SUMIF($D$9:$D$158,\"AB\",J9:J158)","v":0},null,null,{"$f":"SUMIF($D$9:$D$158,\"AB\",M9:M158)","v":0},{"$f":"SUMIF($D$9:$D$158,\"AB\",N9:N158)","v":0},{"$f":"SUMIF($D$9:$D$158,\"AB\",O9:O158)","v":0},{"$f":"SUMIF($D$9:$D$158,\"AB\",P9:P158)","v":0}]
[]
[null,null,"Longitud de la línea de conducción (km)",null,null,null,null,null,null,null,null,null,null,null,null,{"$f":"+J159","v":0}]
[null,null,"Producción Anual (m3)",null,null,null,null,null,null,null,null,null,null,null,null,{"$f":"P159","v":0}]
[null,null,"Agua en bloque (m3/año)",null,null,null,null,null,null,null,null,null,null,null,null,{"$f":"+SUMIF(D9:D158,\"AB\",P9:P158)","v":0}]
[null,null,"Dotación (l/hab/dia)",null,null,null,null,null,null,null,null,null,null,null,null,{"$f":"IFERROR(P163/PobAtendida!D21/365*1000,0)","v":0}]
[null,null,"Medidores instalados funcionando",null,null,null,null,null,null,null,null,null,null,null,null,{"$f":"H159","v":0}]
[]
[null,"Instrucciones de llenado:"]
[null,"En el tipo de fuente utilizar la siguiente nomenclatura. P: Pozo; L: Laguna; D: Deshielo; M: Mar; PS: Pozo somero; N: Noria; G: Galeria; R: Río; Py: Puyón; Lg: Lago; E: Escurrimiento; AB: Agua en Bloque"]
[]
[]
[null,"NOTAS:"]

{"sheet":"Tomas y coberturas","index":10,"n_rows":18,"n_cols":13,"rows_kept":18,"cut":false,"hidden":false,"merged":[[7,9,8,9],[1,1,1,3],[17,2,27,6],[7,1,8,1],[7,2,8,2],[7,8,8,8],[6,2,6,8],[7,3,7,5],[7,6,8,6],[7,7,8,7],[3,2,3,8],[4,2,4,8]]}
[]
[null,"Formato 8.a REGISTRO DE TOMAS Y CONEXIONES",null,null,null,null,null,null,null,null,null,"Formato 8.b DATOS PARA CÁLCULO DE COBERTURAS"]
[]
[null,"NOMBRE:",{"$f":"+Datos!C4","v":"X"}]
[null,"AÑO:",{"$f":"+Datos!C5","v":0},null,null,null,null,null,null,null,null,"Cobertura de agua potable"]
[]
[null,null,"AGUA POTABLE",null,null,null,null,null,null,"ALCANTARILLADO",null,"Población con servicio de agua potable",{"$f":"C10*M9","v":0}]
[null,"Clasificación","Número de tomas","Número de tomas con medidor",null,null,"Tomas sin medidor (cuota fija)","Cobertura de micromedición (%)","Micromedición con lectura","Número de conexiones",null,"Población con servicio de alcantarillado",{"$f":"J10*M9","v":0}]
[null,null,null,"Con medidor","Con lectura ","Sin lectura",null,null,null,null,null,"Índice de hacinamiento"]
[null,"Domésticas",{"$f":"D10+G10","v":0},null,null,{"$f":"D10-E10","v":0},null,{"$f":"IFERROR(D10/C10,0)","v":0},{"$f":"IFERROR(E10/C10,0)","v":0},null,null,"Unidades de vivienda",{"$f":"IFERROR(PobAtendida!G21/'Tomas y coberturas'!M9,0)","v":0}]
[null,"Comerciales",{"$f":"D11+G11","v":0},null,null,{"$f":"D11-E11","v":0},null,{"$f":"IFERROR(D11/C11,0)","v":0},0,null,null,"Tomas domésticas",{"$f":"'Tomas y coberturas'!C10","v":0}]
[null,"Industriales",{"$f":"D12+G12","v":0},null,null,{"$f":"D12-E12","v":0},null,{"$f":"IFERROR(D12/C12,0)","v":0},0,null,null,"Tomas potenciales por instalar",{"$f":"M10-M11","v":0}]
[null,"Servicios públicos",{"$f":"D13+G13","v":0},null,null,{"$f":"D13-E13","v":0},null,{"$f":"IFERROR(D13/C13,0)","v":0},0]
[null,"Otras",{"$f":"D14+G14","v":0},null,null,{"$f":"D14-E14","v":0},null,{"$f":"IFERROR(D14/C14,0)","v":0},0]
[null,"Totales",{"$f":"SUM(C10:C14)","v":0},{"$f":"SUM(D10:D14)","v":0},{"$f":"SUM(E10:E14)","v":0},{"$f":"SUM(F10:F14)","v":0},{"$f":"SUM(G10:G14)","v":0},{"$f":"IFERROR(D15/$C$15,0)","v":0},0,{"$f":"SUM(J10:J14)","v":0}]
[]
[]
[null,"NOTAS:"]

{"sheet":"Tratamiento","index":11,"n_rows":53,"n_cols":14,"rows_kept":53,"cut":false,"hidden":false,"merged":[[1,1,1,3],[52,2,62,6],[3,10,3,12],[49,1,49,7],[42,1,42,3],[43,1,43,3],[44,1,44,3],[45,1,45,3],[46,1,46,3],[3,2,3,7],[4,2,4,7]]}
[]
[null,"Formato 9.a. TRATAMIENTO DE AGUAS RESIDUALES",null,null,null,null,null,null,null,"Formato 9.b PLANTAS POTABILIZADORAS"]
[]
[null,"NOMBRE:",{"$f":"+Datos!C4","v":"X"}]
[null,"AÑO:",{"$f":"+Datos!C5","v":0}]
[]
[null,"Número","Nombre de la planta","Tipo de proceso","Capacidad instalada            l/s","Caudal medio anual tratado             l/s","Volumen anual tratado            m3","Cuerpo receptor",null,"Número","Nombre de la planta","Capacidad instalada                   l/s","Caudal medio anual potabilizado        l/s","Volumen anual potabilizado m3"]
[null,1,null,null,null,null,{"$f":"F8*31536","v":0},null,null,1,null,null,null,{"$f":"M8*31536","v":0}]
[null,2,null,null,null,null,{"$f":"F9*31536","v":0},null,null,2,null,null,null,{"$f":"M9*31536","v":0}]
[null,3,null,null,null,null,{"$f":"F10*31536","v":0},null,null,3,null,null,null,0]
[null,4,null,null,null,null,0,null,null,4,null,null,null,0]
[null,5,null,null,null,null,0,null,null,5,null,null,null,0]
[null,6,null,null,null,null,0,null,null,6,null,null,null,0]
[null,7,null,null,null,null,0,null,null,7,null,null,null,0]
[null,8,null,null,null,null,0,null,null,8,null,null,null,0]
[null,9,null,null,null,null,0,null,null,9,null,null,null,0]
[null,10,null,null,null,null,0,null,null,10,null,null,null,0]
[null,11,null,null,null,null,0,null,null,11,null,null,null,0]
[null,12,null,null,null,null,0,null,null,12,null,null,null,0]
[null,13,null,null,null,null,{"$f":"F20*31536","v":0},null,null,13,null,null,null,{"$f":"M20*31536","v":0}]
[null,14,null,null,null,null,0,null,null,14,null,null,null,0]
[null,15,null,null,null,null,0,null,null,15,null,null,null,0]
[null,16,null,null,null,null,0,null,null,16,null,null,null,0]
[null,17,null,null,null,null,0,null,null,17,null,null,null,0]
[null,18,null,null,null,null,0,null,null,18,null,null,null,0]
[null,19,null,null,null,null,0,null,null,19,null,null,null,0]
[null,20,null,null,null,null,0,null,null,20,null,null,null,0]
[null,21,null,null,null,null,0,null,null,21,null,null,null,0]
[null,22,null,null,null,null,0,null,null,22,null,null,null,0]
[null,23,null,null,null,null,0,null,null,23,null,null,null,0]
[null,24,null,null,null,null,{"$f":"F31*31536","v":0},null,null,24,null,null,null,0]
[null,25,null,null,null,null,0,null,null,25,null,null,null,0]
[null,26,null,null,null,null,0,null,null,26,null,null,null,0]
[null,27,null,null,null,null,0,null,null,27,null,null,null,0]
[null,28,null,null,null,null,0,null,null,28,null,null,null,0]
[null,29,null,null,null,null,0,null,null,29,null,null,null,0]
[null,30,null,null,null,null,{"$f":"F37*31536","v":0},null,null,30,null,null,null,0]
[null,null,null,null,{"$f":"SUM(E8:E37)","v":0},{"$f":"SUM(F8:F37)","v":0},{"$f":"SUM(G8:G37)","v":0},null,null,null,null,{"$f":"SUM(L8:L37)","v":0},{"$f":"SUM(M8:M37)","v":0},{"$f":"SUM(N8:N37)","v":0}]
[]
[]
[null,"COBERTURA DE TRATAMIENTO"]
[]
[null,"Estimación de agua residual colectada con respecto a agua entregada",null,null,0.8]
[null,"Volumen de agua residual colectado",null,null,{"$f":"E43*Facturacion!E14","v":0}]
[null,"Caudal medio anual tratado (lps)",null,null,{"$f":"F38","v":0}]
[null,"Capacidad instalada de tratamiento (lps)",null,null,{"$f":"E38","v":0}]
[null,"Volumen anual tratado (m3)",null,null,{"$f":"G38","v":0}]
[]
[null,"Instrucciones de llenado:"]
[null,"En el tipo de proceso utilizar la siguiente nomenclatura. AN: Anaerobio; DB: Discos Biológicos; BO: Biológico; DU: Dual; FB: Filtros Biológicos; LE: Laguna de estabilización; LA: Lagunas aireadas; LO: Lodos activados; RA: Rafa; RE: Reactor enzimático; SE: Sedimentación; TI: Tanque Imhof; TS: Tanque séptico; TE: Terciario; WL: Wetland; ZO: Zanjas de oxidación."]
[]
[]
[null,"NOTAS:"]

{"sheet":"Facturacion","index":12,"n_rows":17,"n_cols":17,"rows_kept":17,"cut":false,"hidden":false,"merged":[[16,2,26,6],[6,6,6,11],[1,1,1,8],[6,2,6,5],[3,2,3,10],[4,2,4,10]]}
[]
[null,"Formato 10.a. FACTURACIÓN DE AGUA POTABLE, ALCANTARILLADO Y SANEAMIENTO",null,null,null,null,null,null,null,null,null,null,null,null,"10.b INGRESOS (Facturación de APAS y otros servicios)"]
[]
[null,"NOMBRE:",{"$f":"+Datos!C4","v":"X"},null,null,null,null,null,null,null,null,null,null,null,"Concepto","Monto ($)","Proporción (%)"]
[null,"AÑO:",{"$f":"+Datos!C5","v":0},null,null,null,null,null,null,null,null,null,null,null,"Facturación anual de agua potable",{"$f":"I14","v":0},{"$f":"IFERROR(P5/P$14,0)","v":0}]
[null,null,null,null,null,null,null,null,null,null,null,null,null,null,"Facturación anual de alcantarillado",{"$f":"K14","v":0},0]
[null,null,"Volumen anual facturado",null,null,null,"Importe anual facturado",null,null,null,null,null,null,null,"Facturación anual de saneamiento",{"$f":"L14","v":0},0]
[null,"Clasificación","Volumen medido     m3","Cuota fija (estimado)     m3","Total         m3","%","Importe servicio medido            $","Importe cuota fija          $","Total              $","%","Alcantarillado      $","Saneamiento              $",null,null,"Derechos de conexión de agua potable",null,0]
[null,{"$f":"'Tomas y coberturas'!B10","v":"Domésticas"},null,null,{"$f":"SUM(C9:D9)","v":0},{"$f":"IFERROR(E9/E$14,0)","v":0},null,null,{"$f":"SUM(G9:H9)","v":0},{"$f":"IFERROR(I9/I$14,0)","v":0},null,null,null,null,"Derechos de conexión de alcantarillado",null,0]
[null,{"$f":"'Tomas y coberturas'!B11","v":"Comerciales"},null,null,0,{"$f":"IFERROR(E10/E$14,0)","v":0},null,null,0,{"$f":"IFERROR(I10/I$14,0)","v":0},null,null,null,null,"Otros Ingresos operacionales",null,0]
[null,{"$f":"'Tomas y coberturas'!B12","v":"Industriales"},null,null,{"$f":"SUM(C11:D11)","v":0},{"$f":"IFERROR(E11/E$14,0)","v":0},null,null,0,{"$f":"IFERROR(I11/I$14,0)","v":0},null,null,null,null,"Derechos de dotación (Desarrollo habitacional, factibilidades)",null,0]
[null,{"$f":"'Tomas y coberturas'!B13","v":"Servicios públicos"},null,null,0,{"$f":"IFERROR(E12/E$14,0)","v":0},null,null,0,{"$f":"IFERROR(I12/I$14,0)","v":0},null,null,null,null,"Ingresos operacionales",{"$f":"SUM(P5:P11)","v":0},0]
[null,{"$f":"'Tomas y coberturas'!B14","v":"Otras"},null,null,0,{"$f":"IFERROR(E13/E$14,0)","v":0},null,null,0,{"$f":"IFERROR(I13/I$14,0)","v":0},null,null,null,null,"Otros ingresos no operacionales (no considerar aportes Federales, estatales o municipales)",0,0]
[null,{"$f":"'Tomas y coberturas'!B15","v":"Totales"},{"$f":"SUM(C9:C13)","v":0},{"$f":"SUM(D9:D13)","v":0},0,{"$f":"SUM(F9:F13)","v":0},{"$f":"SUM(G9:G13)","v":0},{"$f":"SUM(H9:H13)","v":0},0,{"$f":"SUM(J9:J13)","v":0},{"$f":"SUM(K9:K13)","v":0},{"$f":"SUM(L9:L13)","v":0},null,null,"Ingresos totales",{"$f":"SUM(P12:P13)","v":0},0]
[]
[]
[null,"NOTAS:"]

{"sheet":"EElectrica","index":13,"n_rows":175,"n_cols":24,"rows_kept":175,"cut":false,"hidden":false,"merged":[[1,1,1,9],[174,2,184,6],[171,2,171,16],[165,2,165,7],[166,2,166,7],[167,2,167,7],[168,2,168,7],[3,2,3,13],[4,2,4,13]]}
[]
[null,"Formato 11. ANÁLISIS DEL COSTO DE ENERGÍA ELÉCTRICA"]
[]
[null,"NOMBRE:",{"$f":"+Datos!C4","v":"X"}]
[null,"AÑO",{"$f":"+Datos!C5","v":0}]
[]
[null,"Número","Nombre de la captación","Capacidad instalada  (lps)","Horas de bombeo","Días al mes","Producción mensual (M3)","Lectura actual","Lectura anterior","Consumo (kWh)","Importe del consumo ($)","Cargo extra 1","Cargo extra 2","Subtotal","IVA","Importe total de facturación ($)","Costo unitario de la Energía Eléctrica  ($/kWh)","Factor de potencia","Factor de Carga","Consumo en punta (kWh)","Consumo en periodo intermedio (kWh)","Gasto por demanda de energía eléctrica ($)","Gasto por periodo en punta                          ($)","Gasto por periodo intermedio         ($)"]
[null,{"$f":"Produccion!B9","v":1},{"$f":"Produccion!C9","v":0},{"$f":"Produccion!G9","v":0},{"$f":"Produccion!K9","v":0},{"$f":"+Produccion!L9/12","v":0},{"$f":"3.6*D8*E8*F8","v":0},null,null,{"$f":"H8-I8","v":0},null,null,null,{"$f":"SUM(K8:M8)","v":0},{"$f":"N8*0.16","v":0},{"$f":"SUM(N8:O8)","v":0},{"$f":"IFERROR(K8/J8,0)","v":0}]
[null,{"$f":"Produccion!B10","v":2},{"$f":"Produccion!C10","v":0},{"$f":"Produccion!G10","v":0},{"$f":"Produccion!K10","v":0},{"$f":"+Produccion!L10/12","v":0},0,null,null,0,null,null,null,{"$f":"SUM(K9:M9)","v":0},{"$f":"N9*0.16","v":0},{"$f":"SUM(N9:O9)","v":0},{"$f":"IFERROR(K9/J9,0)","v":0}]
[null,{"$f":"Produccion!B11","v":3},{"$f":"Produccion!C11","v":0},{"$f":"Produccion!G11","v":0},{"$f":"Produccion!K11","v":0},{"$f":"+Produccion!L11/12","v":0},0,null,null,0,null,null,null,{"$f":"SUM(K10:M10)","v":0},0,{"$f":"SUM(N10:O10)","v":0},{"$f":"IFERROR(K10/J10,0)","v":0}]
[null,{"$f":"Produccion!B12","v":4},{"$f":"Produccion!C12","v":0},{"$f":"Produccion!G12","v":0},{"$f":"Produccion!K12","v":0},{"$f":"+Produccion!L12/12","v":0},0,null,null,0,null,null,null,{"$f":"SUM(K11:M11)","v":0},0,{"$f":"SUM(N11:O11)","v":0},{"$f":"IFERROR(K11/J11,0)","v":0}]
[null,{"$f":"Produccion!B13","v":5},{"$f":"Produccion!C13","v":0},{"$f":"Produccion!G13","v":0},{"$f":"Produccion!K13","v":0},{"$f":"+Produccion!L13/12","v":0},0,null,null,0,null,null,null,0,0,0,0]
[null,{"$f":"Produccion!B14","v":6},{"$f":"Produccion!C14","v":0},{"$f":"Produccion!G14","v":0},{"$f":"Produccion!K14","v":0},{"$f":"+Produccion!L14/12","v":0},0,null,null,0,null,null,null,0,0,0,0]
[null,{"$f":"Produccion!B15","v":7},{"$f":"Produccion!C15","v":0},{"$f":"Produccion!G15","v":0},{"$f":"Produccion!K15","v":0},{"$f":"+Produccion!L15/12","v":0},0,null,null,0,null,null,null,0,0,0,0]
[null,{"$f":"Produccion!B16","v":8},{"$f":"Produccion!C16","v":0},{"$f":"Produccion!G16","v":0},{"$f":"Produccion!K16","v":0},{"$f":"+Produccion!L16/12","v":0},0,null,null,0,null,null,null,0,0,0,0]
[null,{"$f":"Produccion!B17","v":9},{"$f":"Produccion!C17","v":0},{"$f":"Produccion!G17","v":0},{"$f":"Produccion!K17","v":0},{"$f":"+Produccion!L17/12","v":0},0,null,null,0,null,null,null,0,0,0,0]
[null,{"$f":"Produccion!B18","v":10},{"$f":"Produccion!C18","v":0},{"$f":"Produccion!G18","v":0},{"$f":"Produccion!K18","v":0},{"$f":"+Produccion!L18/12","v":0},0,null,null,0,null,null,null,0,0,0,0]
[null,{"$f":"Produccion!B19","v":11},{"$f":"Produccion!C19","v":0},{"$f":"Produccion!G19","v":0},{"$f":"Produccion!K19","v":0},{"$f":"+Produccion!L19/12","v":0},0,null,null,0,null,null,null,0,0,0,0]
[null,{"$f":"Produccion!B20","v":12},{"$f":"Produccion!C20","v":0},{"$f":"Produccion!G20","v":0},{"$f":"Produccion!K20","v":0},{"$f":"+Produccion!L20/12","v":0},0,null,null,0,null,null,null,0,0,0,0]
[null,{"$f":"Produccion!B21","v":13},{"$f":"Produccion!C21","v":0},{"$f":"Produccion!G21","v":0},{"$f":"Produccion!K21","v":0},{"$f":"+Produccion!L21/12","v":0},0,null,null,0,null,null,null,0,0,0,0]
[null,{"$f":"Produccion!B22","v":14},{"$f":"Produccion!C22","v":0},{"$f":"Produccion!G22","v":0},{"$f":"Produccion!K22","v":0},{"$f":"+Produccion!L22/12","v":0},0,null,null,0,null,null,null,0,0,0,0]
[null,{"$f":"Produccion!B23","v":15},{"$f":"Produccion!C23","v":0},{"$f":"Produccion!G23","v":0},{"$f":"Produccion!K23","v":0},{"$f":"+Produccion!L23/12","v":0},0,null,null,0,null,null,null,0,0,0,0]
[null,{"$f":"Produccion!B24","v":16},{"$f":"Produccion!C24","v":0},{"$f":"Produccion!G24","v":0},{"$f":"Produccion!K24","v":0},{"$f":"+Produccion!L24/12","v":0},0,null,null,0,null,null,null,0,0,0,0]
[null,{"$f":"Produccion!B25","v":17},{"$f":"Produccion!C25","v":0},{"$f":"Produccion!G25","v":0},{"$f":"Produccion!K25","v":0},{"$f":"+Produccion!L25/12","v":0},0,null,null,0,null,null,null,0,0,0,0]
[null,{"$f":"Produccion!B26","v":18},{"$f":"Produccion!C26","v":0},{"$f":"Produccion!G26","v":0},{"$f":"Produccion!K26","v":0},{"$f":"+Produccion!L26/12","v":0},0,null,null,0,null,null,null,0,0,0,0]
[null,{"$f":"Produccion!B27","v":19},{"$f":"Produccion!C27","v":0},{"$f":"Produccion!G27","v":0},{"$f":"Produccion!K27","v":0},{"$f":"+Produccion!L27/12","v":0},0,null,null,0,null,null,null,0,0,0,0]
[null,{"$f":"Produccion!B28","v":20},{"$f":"Produccion!C28","v":0},{"$f":"Produccion!G28","v":0},{"$f":"Produccion!K28","v":0},{"$f":"+Produccion!L28/12","v":0},0,null,null,0,null,null,null,0,0,0,0]
[null,{"$f":"Produccion!B29","v":21},{"$f":"Produccion!C29","v":0},{"$f":"Produccion!G29","v":0},{"$f":"Produccion!K29","v":0},{"$f":"+Produccion!L29/12","v":0},0,null,null,0,null,null,null,0,0,0,0]
[null,{"$f":"Produccion!B30","v":22},{"$f":"Produccion!C30","v":0},{"$f":"Produccion!G30","v":0},{"$f":"Produccion!K30","v":0},{"$f":"+Produccion!L30/12","v":0},0,null,null,0,null,null,null,0,0,0,0]
[null,{"$f":"Produccion!B31","v":23},{"$f":"Produccion!C31","v":0},{"$f":"Produccion!G31","v":0},{"$f":"Produccion!K31","v":0},{"$f":"+Produccion!L31/12","v":0},0,null,null,0,null,null,null,0,0,0,0]
[null,{"$f":"Produccion!B32","v":24},{"$f":"Produccion!C32","v":0},{"$f":"Produccion!G32","v":0},{"$f":"Produccion!K32","v":0},{"$f":"+Produccion!L32/12","v":0},0,null,null,0,null,null,null,0,0,0,0]
[null,{"$f":"Produccion!B33","v":25},{"$f":"Produccion!C33","v":0},{"$f":"Produccion!G33","v":0},{"$f":"Produccion!K33","v":0},{"$f":"+Produccion!L33/12","v":0},0,null,null,0,null,null,null,0,0,0,0]
[null,{"$f":"Produccion!B34","v":26},{"$f":"Produccion!C34","v":0},{"$f":"Produccion!G34","v":0},{"$f":"Produccion!K34","v":0},{"$f":"+Produccion!L34/12","v":0},0,null,null,0,null,null,null,0,0,0,0]
[null,{"$f":"Produccion!B35","v":27},{"$f":"Produccion!C35","v":0},{"$f":"Produccion!G35","v":0},{"$f":"Produccion!K35","v":0},{"$f":"+Produccion!L35/12","v":0},0,null,null,0,null,null,null,0,0,0,0]
[null,{"$f":"Produccion!B36","v":28},{"$f":"Produccion!C36","v":0},{"$f":"Produccion!G36","v":0},{"$f":"Produccion!K36","v":0},{"$f":"+Produccion!L36/12","v":0},0,null,null,0,null,null,null,0,0,0,0]
[null,{"$f":"Produccion!B37","v":29},{"$f":"Produccion!C37","v":0},{"$f":"Produccion!G37","v":0},{"$f":"Produccion!K37","v":0},{"$f":"+Produccion!L37/12","v":0},0,null,null,0,null,null,null,0,0,0,0]
[null,{"$f":"Produccion!B38","v":30},{"$f":"Produccion!C38","v":0},{"$f":"Produccion!G38","v":0},{"$f":"Produccion!K38","v":0},{"$f":"+Produccion!L38/12","v":0},0,null,null,0,null,null,null,0,0,0,0]
[null,{"$f":"Produccion!B39","v":31},{"$f":"Produccion!C39","v":0},{"$f":"Produccion!G39","v":0},{"$f":"Produccion!K39","v":0},{"$f":"+Produccion!L39/12","v":0},0,null,null,0,null,null,null,0,0,0,0]
[null,{"$f":"Produccion!B40","v":32},{"$f":"Produccion!C40","v":0},{"$f":"Produccion!G40","v":0},{"$f":"Produccion!K40","v":0},{"$f":"+Produccion!L40/12","v":0},0,null,null,0,null,null,null,0,0,0,0]
[null,{"$f":"Produccion!B41","v":33},{"$f":"Produccion!C41","v":0},{"$f":"Produccion!G41","v":0},{"$f":"Produccion!K41","v":0},{"$f":"+Produccion!L41/12","v":0},{"$f":"3.6*D40*E40*F40","v":0},null,null,{"$f":"H40-I40","v":0},null,null,null,0,0,0,0]
[null,{"$f":"Produccion!B42","v":34},{"$f":"Produccion!C42","v":0},{"$f":"Produccion!G42","v":0},{"$f":"Produccion!K42","v":0},{"$f":"+Produccion!L42/12","v":0},0,null,null,0,null,null,null,0,0,0,0]
[null,{"$f":"Produccion!B43","v":35},{"$f":"Produccion!C43","v":0},{"$f":"Produccion!G43","v":0},{"$f":"Produccion!K43","v":0},{"$f":"+Produccion!L43/12","v":0},0,null,null,0,null,null,null,0,0,0,0]
[null,{"$f":"Produccion!B44","v":36},{"$f":"Produccion!C44","v":0},{"$f":"Produccion!G44","v":0},{"$f":"Produccion!K44","v":0},{"$f":"+Produccion!L44/12","v":0},0,null,null,0,null,null,null,0,0,0,0]
[null,{"$f":"Produccion!B45","v":37},{"$f":"Produccion!C45","v":0},{"$f":"Produccion!G45","v":0},{"$f":"Produccion!K45","v":0},{"$f":"+Produccion!L45/12","v":0},0,null,null,0,null,null,null,0,0,0,0]
[null,{"$f":"Produccion!B46","v":38},{"$f":"Produccion!C46","v":0},{"$f":"Produccion!G46","v":0},{"$f":"Produccion!K46","v":0},{"$f":"+Produccion!L46/12","v":0},0,null,null,0,null,null,null,0,0,0,0]
[null,{"$f":"Produccion!B47","v":39},{"$f":"Produccion!C47","v":0},{"$f":"Produccion!G47","v":0},{"$f":"Produccion!K47","v":0},{"$f":"+Produccion!L47/12","v":0},0,null,null,0,null,null,null,0,0,0,0]
[null,{"$f":"Produccion!B48","v":40},{"$f":"Produccion!C48","v":0},{"$f":"Produccion!G48","v":0},{"$f":"Produccion!K48","v":0},{"$f":"+Produccion!L48/12","v":0},0,null,null,0,null,null,null,0,0,0,0]
[null,{"$f":"Produccion!B49","v":41},{"$f":"Produccion!C49","v":0},{"$f":"Produccion!G49","v":0},{"$f":"Produccion!K49","v":0},{"$f":"+Produccion!L49/12","v":0},0,null,null,0,null,null,null,0,0,0,0]
[null,{"$f":"Produccion!B50","v":42},{"$f":"Produccion!C50","v":0},{"$f":"Produccion!G50","v":0},{"$f":"Produccion!K50","v":0},{"$f":"+Produccion!L50/12","v":0},0,null,null,0,null,null,null,0,0,0,0]
[null,{"$f":"Produccion!B51","v":43},{"$f":"Produccion!C51","v":0},{"$f":"Produccion!G51","v":0},{"$f":"Produccion!K51","v":0},{"$f":"+Produccion!L51/12","v":0},0,null,null,0,null,null,null,0,0,0,0]
[null,{"$f":"Produccion!B52","v":44},{"$f":"Produccion!C52","v":0},{"$f":"Produccion!G52","v":0},{"$f":"Produccion!K52","v":0},{"$f":"+Produccion!L52/12","v":0},0,null,null,0,null,null,null,0,0,0,0]
[null,{"$f":"Produccion!B53","v":45},{"$f":"Produccion!C53","v":0},{"$f":"Produccion!G53","v":0},{"$f":"Produccion!K53","v":0},{"$f":"+Produccion!L53/12","v":0},0,null,null,0,null,null,null,0,0,0,0]
[null,{"$f":"Produccion!B54","v":46},{"$f":"Produccion!C54","v":0},{"$f":"Produccion!G54","v":0},{"$f":"Produccion!K54","v":0},{"$f":"+Produccion!L54/12","v":0},0,null,null,0,null,null,null,0,0,0,0]
[null,{"$f":"Produccion!B55","v":47},{"$f":"Produccion!C55","v":0},{"$f":"Produccion!G55","v":0},{"$f":"Produccion!K55","v":0},{"$f":"+Produccion!L55/12","v":0},0,null,null,0,null,null,null,0,0,0,0]
[null,{"$f":"Produccion!B56","v":48},{"$f":"Produccion!C56","v":0},{"$f":"Produccion!G56","v":0},{"$f":"Produccion!K56","v":0},{"$f":"+Produccion!L56/12","v":0},0,null,null,0,null,null,null,0,0,0,0]
[null,{"$f":"Produccion!B57","v":49},{"$f":"Produccion!C57","v":0},{"$f":"Produccion!G57","v":0},{"$f":"Produccion!K57","v":0},{"$f":"+Produccion!L57/12","v":0},0,null,null,0,null,null,null,0,0,0,0]
[null,{"$f":"Produccion!B58","v":50},{"$f":"Produccion!C58","v":0},{"$f":"Produccion!G58","v":0},{"$f":"Produccion!K58","v":0},{"$f":"+Produccion!L58/12","v":0},0,null,null,0,null,null,null,0,0,0,0]
[null,{"$f":"Produccion!B59","v":51},{"$f":"Produccion!C59","v":0},{"$f":"Produccion!G59","v":0},{"$f":"Produccion!K59","v":0},{"$f":"+Produccion!L59/12","v":0},{"$f":"3.6*D58*E58*F58","v":0},null,null,{"$f":"H58-I58","v":0},null,null,null,{"$f":"SUM(K58:M58)","v":0},{"$f":"N58*0.16","v":0},{"$f":"SUM(N58:O58)","v":0},{"$f":"IFERROR(K58/J58,0)","v":0}]
[null,{"$f":"Produccion!B60","v":52},{"$f":"Produccion!C60","v":0},{"$f":"Produccion!G60","v":0},{"$f":"Produccion!K60","v":0},{"$f":"+Produccion!L60/12","v":0},0,null,null,0,null,null,null,0,0,0,0]
[null,{"$f":"Produccion!B61","v":53},{"$f":"Produccion!C61","v":0},{"$f":"Produccion!G61","v":0},{"$f":"Produccion!K61","v":0},{"$f":"+Produccion!L61/12","v":0},0,null,null,0,null,null,null,0,0,0,0]
[null,{"$f":"Produccion!B62","v":54},{"$f":"Produccion!C62","v":0},{"$f":"Produccion!G62","v":0},{"$f":"Produccion!K62","v":0},{"$f":"+Produccion!L62/12","v":0},0,null,null,0,null,null,null,0,0,0,0]
[null,{"$f":"Produccion!B63","v":55},{"$f":"Produccion!C63","v":0},{"$f":"Produccion!G63","v":0},{"$f":"Produccion!K63","v":0},{"$f":"+Produccion!L63/12","v":0},0,null,null,0,null,null,null,0,0,0,0]
[null,{"$f":"Produccion!B64","v":56},{"$f":"Produccion!C64","v":0},{"$f":"Produccion!G64","v":0},{"$f":"Produccion!K64","v":0},{"$f":"+Produccion!L64/12","v":0},0,null,null,0,null,null,null,0,0,0,0]
[null,{"$f":"Produccion!B65","v":57},{"$f":"Produccion!C65","v":0},{"$f":"Produccion!G65","v":0},{"$f":"Produccion!K65","v":0},{"$f":"+Produccion!L65/12","v":0},0,null,null,0,null,null,null,0,0,0,0]
[null,{"$f":"Produccion!B66","v":58},{"$f":"Produccion!C66","v":0},{"$f":"Produccion!G66","v":0},{"$f":"Produccion!K66","v":0},{"$f":"+Produccion!L66/12","v":0},0,null,null,0,null,null,null,0,0,0,0]
[null,{"$f":"Produccion!B67","v":59},{"$f":"Produccion!C67","v":0},{"$f":"Produccion!G67","v":0},{"$f":"Produccion!K67","v":0},{"$f":"+Produccion!L67/12","v":0},0,null,null,0,null,null,null,0,0,0,0]
[null,{"$f":"Produccion!B68","v":60},{"$f":"Produccion!C68","v":0},{"$f":"Produccion!G68","v":0},{"$f":"Produccion!K68","v":0},{"$f":"+Produccion!L68/12","v":0},{"$f":"3.6*D67*E67*F67","v":0},null,null,{"$f":"H67-I67","v":0},null,null,null,{"$f":"SUM(K67:M67)","v":0},{"$f":"N67*0.16","v":0},{"$f":"SUM(N67:O67)","v":0},{"$f":"IFERROR(K67/J67,0)","v":0}]
[null,{"$f":"Produccion!B69","v":61},{"$f":"Produccion!C69","v":0},{"$f":"Produccion!G69","v":0},{"$f":"Produccion!K69","v":0},{"$f":"+Produccion!L69/12","v":0},0,null,null,0,null,null,null,0,0,0,0]
[null,{"$f":"Produccion!B70","v":62},{"$f":"Produccion!C70","v":0},{"$f":"Produccion!G70","v":0},{"$f":"Produccion!K70","v":0},{"$f":"+Produccion!L70/12","v":0},0,null,null,0,null,null,null,0,0,0,0]
[null,{"$f":"Produccion!B71","v":63},{"$f":"Produccion!C71","v":0},{"$f":"Produccion!G71","v":0},{"$f":"Produccion!K71","v":0},{"$f":"+Produccion!L71/12","v":0},0,null,null,0,null,null,null,0,0,0,0]
[null,{"$f":"Produccion!B72","v":64},{"$f":"Produccion!C72","v":0},{"$f":"Produccion!G72","v":0},{"$f":"Produccion!K72","v":0},{"$f":"+Produccion!L72/12","v":0},0,null,null,0,null,null,null,0,0,0,0]
[null,{"$f":"Produccion!B73","v":65},{"$f":"Produccion!C73","v":0},{"$f":"Produccion!G73","v":0},{"$f":"Produccion!K73","v":0},{"$f":"+Produccion!L73/12","v":0},0,null,null,0,null,null,null,0,0,0,0]
[null,{"$f":"Produccion!B74","v":66},{"$f":"Produccion!C74","v":0},{"$f":"Produccion!G74","v":0},{"$f":"Produccion!K74","v":0},{"$f":"+Produccion!L74/12","v":0},0,null,null,0,null,null,null,0,0,0,0]
[null,{"$f":"Produccion!B75","v":67},{"$f":"Produccion!C75","v":0},{"$f":"Produccion!G75","v":0},{"$f":"Produccion!K75","v":0},{"$f":"+Produccion!L75/12","v":0},0,null,null,0,null,null,null,0,0,0,0]
[null,{"$f":"Produccion!B76","v":68},{"$f":"Produccion!C76","v":0},{"$f":"Produccion!G76","v":0},{"$f":"Produccion!K76","v":0},{"$f":"+Produccion!L76/12","v":0},0,null,null,0,null,null,null,0,0,0,0]
[null,{"$f":"Produccion!B77","v":69},{"$f":"Produccion!C77","v":0},{"$f":"Produccion!G77","v":0},{"$f":"Produccion!K77","v":0},{"$f":"+Produccion!L77/12","v":0},0,null,null,0,null,null,null,0,0,0,0]
[null,{"$f":"Produccion!B78","v":70},{"$f":"Produccion!C78","v":0},{"$f":"Produccion!G78","v":0},{"$f":"Produccion!K78","v":0},{"$f":"+Produccion!L78/12","v":0},0,null,null,0,null,null,null,0,0,0,0]
[null,{"$f":"Produccion!B79","v":71},{"$f":"Produccion!C79","v":0},{"$f":"Produccion!G79","v":0},{"$f":"Produccion!K79","v":0},{"$f":"+Produccion!L79/12","v":0},0,null,null,0,null,null,null,0,0,0,0]
[null,{"$f":"Produccion!B80","v":72},{"$f":"Produccion!C80","v":0},{"$f":"Produccion!G80","v":0},{"$f":"Produccion!K80","v":0},{"$f":"+Produccion!L80/12","v":0},{"$f":"3.6*D79*E79*F79","v":0},null,null,{"$f":"H79-I79","v":0},null,null,null,{"$f":"SUM(K79:M79)","v":0},{"$f":"N79*0.16","v":0},{"$f":"SUM(N79:O79)","v":0},{"$f":"IFERROR(K79/J79,0)","v":0}]
[null,{"$f":"Produccion!B81","v":73},{"$f":"Produccion!C81","v":0},{"$f":"Produccion!G81","v":0},{"$f":"Produccion!K81","v":0},{"$f":"+Produccion!L81/12","v":0},0,null,null,0,null,null,null,0,0,0,0]
[null,{"$f":"Produccion!B82","v":74},{"$f":"Produccion!C82","v":0},{"$f":"Produccion!G82","v":0},{"$f":"Produccion!K82","v":0},{"$f":"+Produccion!L82/12","v":0},0,null,null,0,null,null,null,0,0,0,0]
[null,{"$f":"Produccion!B83","v":75},{"$f":"Produccion!C83","v":0},{"$f":"Produccion!G83","v":0},{"$f":"Produccion!K83","v":0},{"$f":"+Produccion!L83/12","v":0},0,null,null,0,null,null,null,0,0,0,0]
[null,{"$f":"Produccion!B84","v":76},{"$f":"Produccion!C84","v":0},{"$f":"Produccion!G84","v":0},{"$f":"Produccion!K84","v":0},{"$f":"+Produccion!L84/12","v":0},0,null,null,0,null,null,null,0,0,0,0]
[null,{"$f":"Produccion!B85","v":77},{"$f":"Produccion!C85","v":0},{"$f":"Produccion!G85","v":0},{"$f":"Produccion!K85","v":0},{"$f":"+Produccion!L85/12","v":0},0,null,null,0,null,null,null,0,0,0,0]
[null,{"$f":"Produccion!B86","v":78},{"$f":"Produccion!C86","v":0},{"$f":"Produccion!G86","v":0},{"$f":"Produccion!K86","v":0},{"$f":"+Produccion!L86/12","v":0},0,null,null,0,null,null,null,0,0,0,0]
[null,{"$f":"Produccion!B87","v":79},{"$f":"Produccion!C87","v":0},{"$f":"Produccion!G87","v":0},{"$f":"Produccion!K87","v":0},{"$f":"+Produccion!L87/12","v":0},0,null,null,0,null,null,null,0,0,0,0]
[null,{"$f":"Produccion!B88","v":80},{"$f":"Produccion!C88","v":0},{"$f":"Produccion!G88","v":0},{"$f":"Produccion!K88","v":0},{"$f":"+Produccion!L88/12","v":0},0,null,null,0,null,null,null,0,0,0,0]
[null,{"$f":"Produccion!B89","v":81},{"$f":"Produccion!C89","v":0},{"$f":"Produccion!G89","v":0},{"$f":"Produccion!K89","v":0},{"$f":"+Produccion!L89/12","v":0},0,null,null,0,null,null,null,0,0,0,0]
[null,{"$f":"Produccion!B90","v":82},{"$f":"Produccion!C90","v":0},{"$f":"Produccion!G90","v":0},{"$f":"Produccion!K90","v":0},{"$f":"+Produccion!L90/12","v":0},0,null,null,0,null,null,null,0,0,0,0]
[null,{"$f":"Produccion!B91","v":83},{"$f":"Produccion!C91","v":0},{"$f":"Produccion!G91","v":0},{"$f":"Produccion!K91","v":0},{"$f":"+Produccion!L91/12","v":0},0,null,null,0,null,null,null,0,0,0,0]
[null,{"$f":"Produccion!B92","v":84},{"$f":"Produccion!C92","v":0},{"$f":"Produccion!G92","v":0},{"$f":"Produccion!K92","v":0},{"$f":"+Produccion!L92/12","v":0},0,null,null,0,null,null,null,0,0,0,0]
[null,{"$f":"Produccion!B93","v":85},{"$f":"Produccion!C93","v":0},{"$f":"Produccion!G93","v":0},{"$f":"Produccion!K93","v":0},{"$f":"+Produccion!L93/12","v":0},0,null,null,0,null,null,null,0,0,0,0]
[null,{"$f":"Produccion!B94","v":86},{"$f":"Produccion!C94","v":0},{"$f":"Produccion!G94","v":0},{"$f":"Produccion!K94","v":0},{"$f":"+Produccion!L94/12","v":0},0,null,null,0,null,null,null,0,0,0,0]
[null,{"$f":"Produccion!B95","v":87},{"$f":"Produccion!C95","v":0},{"$f":"Produccion!G95","v":0},{"$f":"Produccion!K95","v":0},{"$f":"+Produccion!L95/12","v":0},{"$f":"3.6*D94*E94*F94","v":0},null,null,{"$f":"H94-I94","v":0},null,null,null,{"$f":"SUM(K94:M94)","v":0},{"$f":"N94*0.16","v":0},{"$f":"SUM(N94:O94)","v":0},{"$f":"IFERROR(K94/J94,0)","v":0}]
[null,{"$f":"Produccion!B96","v":88},{"$f":"Produccion!C96","v":0},{"$f":"Produccion!G96","v":0},{"$f":"Produccion!K96","v":0},{"$f":"+Produccion!L96/12","v":0},0,null,null,0,null,null,null,0,0,0,0]
[null,{"$f":"Produccion!B97","v":89},{"$f":"Produccion!C97","v":0},{"$f":"Produccion!G97","v":0},{"$f":"Produccion!K97","v":0},{"$f":"+Produccion!L97/12","v":0},0,null,null,0,null,null,null,0,0,0,0]
[null,{"$f":"Produccion!B98","v":90},{"$f":"Produccion!C98","v":0},{"$f":"Produccion!G98","v":0},{"$f":"Produccion!K98","v":0},{"$f":"+Produccion!L98/12","v":0},0,null,null,0,null,null,null,0,0,0,0]
[null,{"$f":"Produccion!B99","v":91},{"$f":"Produccion!C99","v":0},{"$f":"Produccion!G99","v":0},{"$f":"Produccion!K99","v":0},{"$f":"+Produccion!L99/12","v":0},0,null,null,0,null,null,null,0,0,0,0]
[null,{"$f":"Produccion!B100","v":92},{"$f":"Produccion!C100","v":0},{"$f":"Produccion!G100","v":0},{"$f":"Produccion!K100","v":0},{"$f":"+Produccion!L100/12","v":0},0,null,null,0,null,null,null,0,0,0,0]
[null,{"$f":"Produccion!B101","v":93},{"$f":"Produccion!C101","v":0},{"$f":"Produccion!G101","v":0},{"$f":"Produccion!K101","v":0},{"$f":"+Produccion!L101/12","v":0},0,null,null,0,null,null,null,0,0,0,0]
[null,{"$f":"Produccion!B102","v":94},{"$f":"Produccion!C102","v":0},{"$f":"Produccion!G102","v":0},{"$f":"Produccion!K102","v":0},{"$f":"+Produccion!L102/12","v":0},0,null,null,0,null,null,null,0,0,0,0]
[null,{"$f":"Produccion!B103","v":95},{"$f":"Produccion!C103","v":0},{"$f":"Produccion!G103","v":0},{"$f":"Produccion!K103","v":0},{"$f":"+Produccion!L103/12","v":0},0,null,null,0,null,null,null,0,0,0,0]
[null,{"$f":"Produccion!B104","v":96},{"$f":"Produccion!C104","v":0},{"$f":"Produccion!G104","v":0},{"$f":"Produccion!K104","v":0},{"$f":"+Produccion!L104/12","v":0},0,null,null,0,null,null,null,0,0,0,0]
[null,{"$f":"Produccion!B105","v":97},{"$f":"Produccion!C105","v":0},{"$f":"Produccion!G105","v":0},{"$f":"Produccion!K105","v":0},{"$f":"+Produccion!L105/12","v":0},0,null,null,0,null,null,null,0,0,0,0]
[null,{"$f":"Produccion!B106","v":98},{"$f":"Produccion!C106","v":0},{"$f":"Produccion!G106","v":0},{"$f":"Produccion!K106","v":0},{"$f":"+Produccion!L106/12","v":0},0,null,null,0,null,null,null,0,0,0,0]
[null,{"$f":"Produccion!B107","v":99},{"$f":"Produccion!C107","v":0},{"$f":"Produccion!G107","v":0},{"$f":"Produccion!K107","v":0},{"$f":"+Produccion!L107/12","v":0},0,null,null,0,null,null,null,0,0,0,0]
[null,{"$f":"Produccion!B108","v":100},{"$f":"Produccion!C108","v":0},{"$f":"Produccion!G108","v":0},{"$f":"Produccion!K108","v":0},{"$f":"+Produccion!L108/12","v":0},0,null,null,0,null,null,null,0,0,0,0]
[null,{"$f":"+B107+1","v":101},null,null,null,null,{"$f":"3.6*D108*E108*F108","v":0},null,null,{"$f":"H108-I108","v":0},null,null,null,{"$f":"SUM(K108:M108)","v":0},{"$f":"N108*0.16","v":0},{"$f":"SUM(N108:O108)","v":0},{"$f":"IFERROR(K108/J108,0)","v":0}]
[null,{"$f":"1+B108","v":102},null,null,null,null,{"$f":"3.6*D109*E109*F109","v":0},null,null,{"$f":"H109-I109","v":0},null,null,null,{"$f":"SUM(K109:M109)","v":0},{"$f":"N109*0.16","v":0},{"$f":"SUM(N109:O109)","v":0},{"$f":"IFERROR(K109/J109,0)","v":0}]
[null,103,null,null,null,null,{"$f":"3.6*D110*E110*F110","v":0},null,null,{"$f":"H110-I110","v":0},null,null,null,{"$f":"SUM(K110:M110)","v":0},{"$f":"N110*0.16","v":0},{"$f":"SUM(N110:O110)","v":0},{"$f":"IFERROR(K110/J110,0)","v":0}]
[null,104,null,null,null,null,{"$f":"3.6*D111*E111*F111","v":0},null,null,{"$f":"H111-I111","v":0},null,null,null,{"$f":"SUM(K111:M111)","v":0},{"$f":"N111*0.16","v":0},{"$f":"SUM(N111:O111)","v":0},{"$f":"IFERROR(K111/J111,0)","v":0}]
[null,105,null,null,null,null,0,null,null,0,null,null,null,0,0,0,0]
[null,106,null,null,null,null,0,null,null,0,null,null,null,0,0,0,0]
[null,107,null,null,null,null,0,null,null,0,null,null,null,0,0,0,0]
[null,108,null,null,null,null,0,null,null,0,null,null,null,0,0,0,0]
[null,109,null,null,null,null,0,null,null,0,null,null,null,0,0,0,0]
[null,110,null,null,null,null,0,null,null,0,null,null,null,0,0,0,0]
[null,111,null,null,null,null,0,null,null,0,null,null,null,0,0,0,0]
[null,112,null,null,null,null,0,null,null,0,null,null,null,0,0,0,0]
[null,113,null,null,null,null,0,null,null,0,null,null,null,0,0,0,0]
[null,114,null,null,null,null,0,null,null,0,null,null,null,0,0,0,0]
[null,115,null,null,null,null,0,null,null,0,null,null,null,0,0,0,0]
[null,116,null,null,null,null,0,null,null,0,null,null,null,0,0,0,0]
[null,117,null,null,null,null,0,null,null,0,null,null,null,0,0,0,0]
[null,118,null,null,null,null,0,null,null,0,null,null,null,0,0,0,0]
[null,119,null,null,null,null,0,null,null,0,null,null,null,0,0,0,0]
[null,120,null,null,null,null,0,null,null,0,null,null,null,0,0,0,0]
[null,121,null,null,null,null,0,null,null,0,null,null,null,0,0,0,0]
[null,122,null,null,null,null,0,null,null,0,null,null,null,0,0,0,0]
[null,123,null,null,null,null,0,null,null,0,null,null,null,0,0,0,0]
[null,124,null,null,null,null,0,null,null,0,null,null,null,0,0,0,0]
[null,125,null,null,null,null,0,null,null,0,null,null,null,0,0,0,0]
[null,126,null,null,null,null,0,null,null,0,null,null,null,0,0,0,0]
[null,127,null,null,null,null,0,null,null,0,null,null,null,0,0,0,0]
[null,128,null,null,null,null,0,null,null,0,null,null,null,0,0,0,0]
[null,129,null,null,null,null,0,null,null,0,null,null,null,0,0,0,0]
[null,130,null,null,null,null,0,null,null,0,null,null,null,0,0,0,0]
[null,131,null,null,null,null,0,null,null,0,null,null,null,0,0,0,0]
[null,132,null,null,null,null,0,null,null,0,null,null,null,0,0,0,0]
[null,133,null,null,null,null,0,null,null,0,null,null,null,0,0,0,0]
[null,134,null,null,null,null,0,null,null,0,null,null,null,0,0,0,0]
[null,135,null,null,null,null,0,null,null,0,null,null,null,0,0,0,0]
[null,136,null,null,null,null,0,null,null,0,null,null,null,0,0,0,0]
[null,137,null,null,null,null,0,null,null,0,null,null,null,0,0,0,0]
[null,{"$f":"1+B144","v":138},null,null,null,null,{"$f":"3.6*D145*E145*F145","v":0},null,null,{"$f":"H145-I145","v":0},null,null,null,{"$f":"SUM(K145:M145)","v":0},{"$f":"N145*0.16","v":0},{"$f":"SUM(N145:O145)","v":0},{"$f":"IFERROR(K145/J145,0)","v":0}]
[null,139,null,null,null,null,0,null,null,0,null,null,null,0,0,0,0]
[null,140,null,null,null,null,0,null,null,0,null,null,null,0,0,0,0]
[null,{"$f":"1+B147","v":141},null,null,null,null,0,null,null,0,null,null,null,0,0,0,0]
[null,142,null,null,null,null,0,null,null,0,null,null,null,0,0,0,0]
[null,143,null,null,null,null,0,null,null,0,null,null,null,0,0,0,0]
[null,144,null,null,null,null,0,null,null,0,null,null,null,0,0,0,0]
[null,145,null,null,null,null,0,null,null,0,null,null,null,0,0,0,0]
[null,146,null,null,null,null,0,null,null,0,null,null,null,0,0,0,0]
[null,147,null,null,null,null,0,null,null,0,null,null,null,0,0,0,0]
[null,148,null,null,null,null,0,null,null,0,null,null,null,0,0,0,0]
[null,149,null,null,null,null,0,null,null,0,null,null,null,0,0,0,0]
[null,150,null,null,null,null,0,null,null,0,null,null,null,0,0,0,0]
[null,null,null,{"$f":"+SUM(D8:D157)","v":0},null,null,{"$f":"+SUM(G8:G157)","v":0},null,null,{"$f":"+SUM(J8:J157)","v":0},0,0,0,0,0,0,0,{"$f":"IFERROR(SUMPRODUCT(R8:R157,J8:J157)/SUM(J8:J157),0)","v":0},{"$f":"IFERROR(SUMPRODUCT(S8:S157,J8:J157)/SUM(J8:J157),0)","v":0},{"$f":"+SUM(T8:T157)","v":0},{"$f":"+SUM(U8:U157)","v":0},{"$f":"+SUM(V8:V157)","v":0},{"$f":"+SUM(W8:W157)","v":0},{"$f":"+SUM(X8:X157)","v":0}]
[]
[null,null,"Costo mensual de la Energía Eléctrica ",null,null,null,null,null,"$",{"$f":"+N158","v":0}]
[null,null,"Costo anual de la Energía Eléctrica ",null,null,null,null,null,"$",{"$f":"+J160*12","v":0}]
[null,null,"Volumen producido anual",null,null,null,null,null,"Mill m3",{"$f":"Produccion!P163","v":0}]
[null,null,"Costo de la energía eléctrica por metro cúbico producido",null,null,null,null,null,"$",{"$f":"IFERROR(J161/J162,0)","v":0}]
[null,null,"Volumen entregado a la ciudad (volumen facturado) mensual",null,null,null,null,null,"Mill m3",{"$f":"Facturacion!E14/12","v":0}]
[null,null,"Costo de la energía eléctrica por metro cúbico facturado",null,null,null,null,null,"$",{"$f":"IFERROR(J160/J164,0)","v":0}]
[null,null,"Gasto de energía por demanda de energía eléctrica (mes)",null,null,null,null,null,"$",{"$f":"+V158","v":0}]
[null,null,"Gasto de energía por periodo en punta (mes)",null,null,null,null,null,"$",{"$f":"+W158","v":0}]
[null,null,"Gasto de energía por periodo intermedio (mes)",null,null,null,null,null,"$",{"$f":"+X158","v":0}]
[null,null,"Porcentaje de Consumo en Punta (promedio)",null,null,null,null,null,"%",{"$f":"IFERROR(T158/J158,0)","v":0}]
[]
[null,null,"Instrucciones de llenado:"]
[null,null,"Se considera un mes como representativo para el cálculo de los datos anuales; sin embargo, pueden hacerse los registros y los cálculos para cada mes y luego sacar el promedio anual."]
[]
[]
[null,"NOTAS:"]

{"sheet":"Sercontinuo","index":14,"n_rows":63,"n_cols":8,"rows_kept":63,"cut":false,"hidden":false,"merged":[[1,1,1,9],[62,2,72,6],[6,1,7,1],[6,2,7,2],[6,3,7,3],[6,4,7,4],[6,5,7,5],[6,6,7,6],[6,7,7,7],[3,2,3,9],[4,2,4,9]]}
[]
[null,"Formato 12. CONTINUIDAD EN EL SERVICIO"]
[]
[null,"NOMBRE:",{"$f":"+Datos!C4","v":"X"}]
[null,"AÑO:",{"$f":"+Datos!C5","v":0}]
[]
[null,"Colonias o Sectores","Número de tomas","Tomas con servicio continuo","Tomas con servicio intermitente","Horas con servicio al mes de las tomas con servicio intermitente","Tiempo promedio de servicio","Tomas con servicio continuo (%)"]
[]
[null,null,{"$f":"SUM(D9:E9)","v":0},null,null,null,{"$f":"IFERROR((((D9*720)+(E9*F9))/C9)/30,0)","v":0},{"$f":"IFERROR(D9/C9,0)","v":0}]
[null,null,{"$f":"SUM(D10:E10)","v":0},null,null,null,{"$f":"IFERROR((((D10*720)+(E10*F10))/C10)/30,0)","v":0},{"$f":"IFERROR(D10/C10,0)","v":0}]
[null,null,0,null,null,null,0,0]
[null,null,0,null,null,null,0,0]
[null,null,0,null,null,null,0,0]
[null,null,0,null,null,null,0,0]
[null,null,0,null,null,null,0,0]
[null,null,0,null,null,null,0,0]
[null,null,0,null,null,null,{"$f":"IFERROR((((D17*720)+(E17*F17))/C17)/30,0)","v":0},{"$f":"IFERROR(D17/C17,0)","v":0}]
[null,null,0,null,null,null,0,0]
[null,null,0,null,null,null,0,0]
[null,null,0,null,null,null,0,0]
[null,null,0,null,null,null,0,0]
[null,null,0,null,null,null,0,0]
[null,null,0,null,null,null,0,0]
[null,null,0,null,null,null,0,0]
[null,null,0,null,null,null,0,0]
[null,null,0,null,null,null,0,0]
[null,null,0,null,null,null,0,0]
[null,null,0,null,null,null,0,0]
[null,null,0,null,null,null,0,0]
[null,null,0,null,null,null,0,0]
[null,null,0,null,null,null,0,0]
[null,null,0,null,null,null,0,0]
[null,null,0,null,null,null,0,0]
[null,null,0,null,null,null,0,0]
[null,null,0,null,null,null,0,0]
[null,null,0,null,null,null,0,0]
[null,null,0,null,null,null,0,0]
[null,null,0,null,null,null,0,0]
[null,null,0,null,null,null,0,0]
[null,null,0,null,null,null,0,0]
[null,null,0,null,null,null,0,0]
[null,null,0,null,null,null,0,0]
[null,null,0,null,null,null,0,0]
[null,null,0,null,null,null,0,0]
[null,null,0,null,null,null,0,0]
[null,null,0,null,null,null,0,0]
[null,null,0,null,null,null,0,0]
[null,null,0,null,null,null,0,0]
[null,null,0,null,null,null,0,0]
[null,null,0,null,null,null,0,0]
[null,null,0,null,null,null,0,0]
[null,null,0,null,null,null,0,0]
[null,null,0,null,null,null,0,0]
[null,null,0,null,null,null,0,0]
[null,null,0,null,null,null,0,0]
[null,null,0,null,null,null,0,0]
[null,null,0,null,null,null,0,0]
[null,null,0,null,null,null,0,0]
[null,"Totales",{"$f":"SUM(C9:C58)","v":0},{"$f":"SUM(D9:D58)","v":0},{"$f":"SUM(E9:E58)","v":0},{"$f":"SUM(F9:F58)","v":0},{"$f":"SUM(G9:G58)/12","v":0},{"$f":"IFERROR(D59/C59,0)","v":0}]
[null,null,null,null,null,null,null,{"$f":"IFERROR(SUMPRODUCT(C9:C58,G9:G58)/(C59*24),0)","v":0}]
[]
[]
[null,"NOTAS:"]

{"sheet":"Medescompuestos","index":15,"n_rows":22,"n_cols":8,"rows_kept":22,"cut":false,"hidden":false,"merged":[[1,1,1,9],[21,2,31,6],[3,2,3,9],[4,2,4,9]]}
[]
[null,"Formato 13. REPORTE DE MEDIDORES DESCOMPUESTOS"]
[null,"Para ingresar esta planilla debe estar ingresada la planilla de Tomas y Coberturas"]
[null,"NOMBRE:",{"$f":"+Datos!C4","v":"X"}]
[null,"AÑO:",{"$f":"+Datos!C5","v":0}]
[]
[null,"Causas","Doméstico","Comercial","Industrial","Servicios públicos","Otros","Total"]
[null,"MEDIDOR ATORADO",null,null,null,null,null,{"$f":"SUM(C8:G8)","v":0}]
[null,"MEDIDOR QUEMADO",null,null,null,null,null,0]
[null,"MEDIDOR DESTRUIDO",null,null,null,null,null,0]
[null,"NO HAY MEDIDOR",null,null,null,null,null,0]
[null,"FUERA DE SERVICIO",null,null,null,null,null,0]
[null,"OTRA",null,null,null,null,null,0]
[null,"Totales",{"$f":"SUM(C8:C13)","v":0},0,0,0,0,0]
[]
[]
[null,"Coberturas","Doméstico","Comercial","Industrial","Servicios públicos","Otros","Total"]
[null,"Total de Tomas c/medidor",{"$f":"'Tomas y coberturas'!D$10","v":0},{"$f":"'Tomas y coberturas'!D$11","v":0},{"$f":"'Tomas y coberturas'!D$12","v":0},{"$f":"'Tomas y coberturas'!D$13","v":0},{"$f":"'Tomas y coberturas'!D$14","v":0},{"$f":"SUM(C18:G18)","v":0}]
[null,"Medidores funcionando",{"$f":"C18-C14","v":0},0,0,0,0,0]
[]
[]
[null,"NOTAS:"]

{"sheet":"Deudxservicio","index":16,"n_rows":42,"n_cols":9,"rows_kept":42,"cut":false,"hidden":false,"merged":[[41,2,51,6],[34,1,34,3],[35,1,35,3],[33,1,33,3],[1,1,1,9],[3,2,3,7],[4,2,4,7]]}
[]
[null,"Formato 14. DEUDORES POR SERVICIO"]
[]
[null,"NOMBRE:",{"$f":"+Datos!C4","v":"X"}]
[null,"AÑO:",{"$f":"+Datos!C5","v":0}]
[]
[null,"Fecha","Referencia","Concepto","Cargo","Abono","Saldo","Días de atraso","Eficiencia comercial (%)"]
[null,"2005-01-31",null,"Facturación de enero"]
[null,"2005-01-31",null,"Recaudación de enero",null,null,{"$f":"E8-F9","v":0},{"$f":"IFERROR(G9*30/E8,0)","v":0},{"$f":"IFERROR(F9/E8,0)","v":0}]
[null,"2005-02-28",null,"Facturaciónde febrero"]
[null,"2005-02-28",null,"Recaudación de febrero",null,null,{"$f":"E10-F11+G9","v":0},{"$f":"IFERROR(G11*60/(E8+E10),0)","v":0},{"$f":"IFERROR((F9+F11)/(E10+E8),0)","v":0}]
[null,"2005-03-31",null,"Facturación de marzo"]
[null,"2005-03-31",null,"Recaudación de marzo",null,null,{"$f":"E12-F13+G11","v":0},{"$f":"IFERROR(G13*90/(E8+E10+E12),0)","v":0},{"$f":"IFERROR((F9+F11+F13)/(E8+E12+E10),0)","v":0}]
[null,"2005-04-30",null,"Facturación de abril"]
[null,"2005-04-30",null,"Recaudación de abril",null,null,{"$f":"E14-F15+G13","v":0},{"$f":"IFERROR(G15*120/(E8+E10+E12+E14),0)","v":0},{"$f":"IFERROR((F9+F11+F13+F15)/(E8+E10+E14+E12),0)","v":0}]
[null,"2005-05-31",null,"Facturación de mayo"]
[null,"2005-05-31",null,"Recaudación de mayo",null,null,{"$f":"E16-F17+G15","v":0},{"$f":"IFERROR(G17*150/(E8+E10+E12+E14+E16),0)","v":0},{"$f":"IFERROR((F9+F11+F13+F15+F17)/(E8+E10+E12+E16+E14),0)","v":0}]
[null,"2005-06-30",null,"Facturación de junio"]
[null,"2005-06-30",null,"Recaudación de junio",null,null,{"$f":"E18-F19+G17","v":0},{"$f":"IFERROR(G19*180/(E8+E10+E12+E14+E16+E18),0)","v":0},{"$f":"IFERROR((F9+F11+F13+F15+F17+F19)/(E8+E10+E12+E14+E18+E16),0)","v":0}]
[null,"2005-07-31",null,"Facturación de julio"]
[null,"2005-07-31",null,"Recaudación de julio",null,null,{"$f":"E20-F21+G19","v":0},{"$f":"IFERROR(G21*210/(E8+E10+E12+E14+E16+E18+E20),0)","v":0},{"$f":"IFERROR((F9+F11+F13+F15+F17+F19+F21)/(E8+E10+E12+E14+E16+E20+E18),0)","v":0}]
[null,"2005-08-31",null,"Facturación de agosto"]
[null,"2005-08-31",null,"Recaudación de agosto",null,null,{"$f":"E22-F23+G21","v":0},{"$f":"IFERROR(G23*240/(E8+E10+E12+E14+E16+E18+E20+E22),0)","v":0},{"$f":"IFERROR((F9+F11+F13+F15+F17+F19+F21+F23)/(E8+E10+E12+E14+E16+E18+E22+E20),0)","v":0}]
[null,"2005-09-30",null,"Facturación de septiembre"]
[null,"2005-09-30",null,"Recaudación de septiembre",null,null,{"$f":"E24-F25+G23","v":0},{"$f":"IFERROR(G25*270/(E8+E10+E12+E14+E16+E18+E20+E22+E24),0)","v":0},{"$f":"IFERROR((F9+F11+F13+F15+F17+F19+F21+F23+F25)/(E8+E10+E12+E14+E16+E18+E20+E24+E22),0)","v":0}]
[null,"2005-10-31",null,"Facturación de octubre"]
[null,"2005-10-31",null,"Recaudación de octubre",null,null,{"$f":"E26-F27+G25","v":0},{"$f":"IFERROR(G27*300/(E8+E10+E12+E14+E16+E18+E20+E22+E24+E26),0)","v":0},{"$f":"IFERROR((F9+F11+F13+F15+F17+F19+F21+F23+F25+F27)/(E8+E10+E12+E14+E16+E18+E20+E22+E26+E24),0)","v":0}]
[null,"2005-11-30",null,"Facturación de noviembre"]
[null,"2005-11-30",null,"Recaudación de noviembre",null,null,{"$f":"E28-F29+G27","v":0},{"$f":"IFERROR(G29*330/(E8+E10+E12+E14+E16+E18+E20+E22+E24+E26+E28),0)","v":0},{"$f":"IFERROR((F9+F11+F13+F15+F17+F19+F21+F23+F25+F27+F29)/(E8+E10+E12+E14+E16+E18+E20+E22+E24+E28+E26),0)","v":0}]
[null,"2005-12-31",null,"Facturación de diciembre"]
[null,"2005-12-31",null,"Recaudación de diciembre",null,null,{"$f":"E30-F31+G29","v":0},{"$f":"IFERROR(G31*360/(E8+E10+E12+E14+E16+E18+E20+E22+E24+E26+E28+E30),0)","v":0},{"$f":"IFERROR((F9+F11+F13+F15+F17+F19+F21+F23+F25+F27+F29+F31)/(E8+E10+E12+E14+E16+E18+E20+E22+E24+E26+E30+E28),0)","v":0}]
[null,null,null,"TOTAL",{"$f":"SUM(E8:E31)","v":0},{"$f":"SUM(F8:F31)","v":0},null,{"$f":"H31/30","v":0},{"$f":"IFERROR(F32/E32,0)","v":0}]
[null,null,null,null,{"$f":"+IFERROR(IF(AND(E32>0,((Facturacion!I14+Facturacion!K14+Facturacion!L14-E32)/E32)<=0.5%,Facturacion!I14+Facturacion!K14+Facturacion!L14>0,((E32-Facturacion!I14-Facturacion!K14-Facturacion!L14)/E32)<=0.5%), \"\",\"LOS TOTALES deben ser iguales al total facturado de A.P., Alc. y saneamiento de la hoja FACTURACION\"),\" \")","v":" "}]
[null,"Recaudación de servicios.",null,null,{"$f":"F32","v":0}]
[null,"Antigüedad de saldos",null,null,{"$f":"H32","v":0},"meses"]
[null,"Eficiencia comercial",null,null,{"$f":"I32","v":0}]
[]
[null,"Instrucciones de llenado:"]
[null,"Solo es facturación y recaudación del año en estudio, no se anotan los rezagos de años anteriores."]
[]
[]
[null,"NOTAS:"]

{"sheet":"Empleados","index":17,"n_rows":25,"n_cols":6,"rows_kept":25,"cut":false,"hidden":false,"merged":[[1,1,1,9],[24,2,34,6],[3,2,3,7],[4,2,4,7]]}
[]
[null,"Formato 15. PERSONAL"]
[]
[null,"NOMBRE:",{"$f":"+Datos!C4","v":"X"}]
[null,"AÑO:",{"$f":"+Datos!C5","v":0}]
[]
[null,"Areas de trabajo","Número de empleados","Número de empleados sindicalizados","Número de empleados de confianza","Número de empleados que no dependen del OO (outsourcing)"]
[null,"Captación",{"$f":"SUM(D8:E8)","v":0}]
[null,"Conducción",{"$f":"SUM(D9:E9)","v":0}]
[null,"Potabilizadora o Cloración",0]
[null,"Almacenamiento",0]
[null,"Rebombeos",0]
[null,"Distribución",0]
[null,"Toma domiciliaria",0]
[null,"Alcantarillado",0]
[null,"Planta de Tratamiento",0]
[null,"Comercialización",0]
[null,"Administración",0]
[null,"O&M",0,{"$f":"SUM(D8:D16)","v":0},{"$f":"SUM(E8:E16)","v":0},{"$f":"SUM(F8:F16)","v":0}]
[null,"ADM & Comercial",0,{"$f":"D17+D18","v":0},{"$f":"E17+E18","v":0},{"$f":"F17+F18","v":0}]
[null,"Otros",0,0,0,0]
[null,"TOTAL",{"$f":"SUM(C19:C21)","v":0},{"$f":"SUM(D19:D21)","v":0},{"$f":"SUM(E19:E21)","v":0},{"$f":"SUM(F19:F21)","v":0}]
[]
[]
[null,"NOTAS:"]

{"sheet":"Costos","index":18,"n_rows":41,"n_cols":12,"rows_kept":41,"cut":false,"hidden":false,"merged":[[27,1,27,4],[6,1,6,4],[40,2,50,6],[6,7,6,11],[3,2,3,8],[4,2,4,8],[29,7,29,8],[34,7,34,8]]}
[]
[null,"Formato 16. EGRESOS (GASTOS)"]
[]
[null,"NOMBRE:",{"$f":"+Datos!C4","v":"X"}]
[null,"AÑO:",{"$f":"+Datos!C5","v":0}]
[]
[null,"GASTOS POR PROCESO",null,null,null,null,null,"DEUDAS"]
[null,"Centro de Gastos","Importe","%","Costo por metro cúbico producido",null,null,"Nombre del Acreedor","Motivo de la Deuda","Monto Anual de Amortización","Monto Anual de Intereses","Plazo remanente (años)"]
[null,"Captación",null,{"$f":"IFERROR(C9/$C$26,0)","v":0},{"$f":"IFERROR(C9/Produccion!P$159,0)","v":0}]
[null,"Conducción",null,{"$f":"IFERROR(C10/$C$26,0)","v":0},{"$f":"IFERROR(C10/Produccion!P$159,0)","v":0}]
[null,"Potabilizadora o Cloración",null,0,{"$f":"IFERROR(C11/Produccion!P$159,0)","v":0}]
[null,"Almacenamiento",null,0,{"$f":"IFERROR(C12/Produccion!P$159,0)","v":0}]
[null,"Rebombeos",null,0,{"$f":"IFERROR(C13/Produccion!P$159,0)","v":0}]
[null,"Distribución",null,0,{"$f":"IFERROR(C14/Produccion!P$159,0)","v":0}]
[null,"Tomas domiciliarias",null,0,{"$f":"IFERROR(C15/Produccion!P$159,0)","v":0}]
[null,"Subtotal",{"$f":"SUM(C9:C15)","v":0},{"$f":"IFERROR(C16/$C$26,0)","v":0},{"$f":"IFERROR(C16/Produccion!P$159,0)","v":0}]
[null,"Alcantarillado",null,{"$f":"IFERROR(C17/$C$26,0)","v":0},{"$f":"IFERROR(C17/Produccion!P$159,0)","v":0}]
[null,"Saneamiento",null,0,{"$f":"IFERROR(C18/Produccion!P$159,0)","v":0}]
[null,"Comercialización",null,0,{"$f":"IFERROR(C19/Produccion!P$159,0)","v":0}]
[null,"Administración",null,0,{"$f":"IFERROR(C20/Produccion!P$159,0)","v":0}]
[null,"Gastos operacionales",{"$f":"SUM(C16:C20)","v":0},{"$f":"IFERROR(C21/$C$26,0)","v":0},{"$f":"IFERROR(C21/Produccion!P$159,0)","v":0}]
[null,"Gastos Financieros",{"$f":"+SUM(K9:K15)","v":0},0,{"$f":"IFERROR(C22/Produccion!P$159,0)","v":0}]
[null,"Inversiones",null,0,{"$f":"IFERROR(C23/Produccion!P$159,0)","v":0}]
[null,"Servicio de la Deuda",{"$f":"+SUM(J9:J15)","v":0},0,{"$f":"IFERROR(C24/Produccion!P$159,0)","v":0}]
[null,"Otros Gastos No operacionales",null,{"$f":"IFERROR(C25/$C$26,0)","v":0},{"$f":"IFERROR(C25/Produccion!P$159,0)","v":0},null,null,{"$f":"+IF(OR(D25<Parametros!$C$38,D25>Parametros!$D$38), \"DEBE INGRESAR JUSTIFICACIÓN POR ALTO VALOR DE OTROS GASTOS\",\"\")","v":""}]
[null,"Total",{"$f":"SUM(C21:C25)","v":0},{"$f":"IFERROR(C26/$C$26,0)","v":0},{"$f":"IFERROR(C26/Produccion!P$159,0)","v":0}]
[]
[null,"GASTOS POR CONCEPTO"]
[null,"Distribución de Gastos","Importe","%","Costo por metro cúbico producido"]
[null,"Sueldos y Prestaciones",null,{"$f":"IFERROR(C30/C$38,0)","v":0},{"$f":"IFERROR(C30/Produccion!P$159,0)","v":0},null,null,"PAGO DE DERECHOS"]
[null,"Energía Eléctrica",null,0,{"$f":"IFERROR(C31/Produccion!P$159,0)","v":0},null,null,"TIPO DE DERECHO","Monto en $"]
[null,"Materiales",null,0,{"$f":"IFERROR(C32/Produccion!P$159,0)","v":0},null,null,"Extracción"]
[null,"Pago de Derechos",{"$f":"+I32+I33","v":0},0,{"$f":"IFERROR(C33/Produccion!P$159,0)","v":0},null,null,"Descarga"]
[null,"Otros gastos operacionales",{"$f":"SUM(I37:I39)","v":0},0,{"$f":"IFERROR(C34/Produccion!P$159,0)","v":0}]
[null,"Cloro y Reactivos",null,0,{"$f":"IFERROR(C35/Produccion!P$159,0)","v":0},null,null,"OTROS GASTOS OPERACIONALES"]
[null,"Gastos operacionales",{"$f":"SUM(C30:C35)","v":0},0,{"$f":"IFERROR(C36/Produccion!P$159,0)","v":0},null,null,"TIPO DE DERECHO","Monto en $"]
[null,"Gastos No operacionales",{"$f":"+SUM(C22:C25)","v":0},0,{"$f":"IFERROR(C37/Produccion!P$159,0)","v":0},null,null,"Agua en Bloque"]
[null,"Total",{"$f":"SUM(C36:C37)","v":0},0,{"$f":"SUM(E36:E37)","v":0},null,null,"Saneamiento"]
[null,null,null,null,null,null,null,"Otros"]
[null,null,{"$f":"+IFERROR(IF(AND(C38>0,((C26-C38)/C26)<=0.1%,C26>0,((C38-C26)/C38)<=0.1%), \"\",\"DEBEN CUADRAR LOS TOTALES\"),\" \")","v":" "}]
[null,"NOTAS:"]

{"sheet":"BalanceG","index":19,"n_rows":39,"n_cols":10,"rows_kept":39,"cut":false,"hidden":false,"merged":[[6,1,6,9],[7,1,7,9],[8,1,8,9],[38,2,48,6],[3,2,3,10],[4,2,4,10]]}
[]
[null,"Formato 17. Balance General"]
[]
[null,"NOMBRE:",{"$f":"+Datos!C4","v":"X"}]
[null,"AÑO:",{"$f":"+Datos!C5","v":0}]
[]
[null,"BALANCE GENERAL DEL "]
[null,{"$f":"Indicadores!C4","v":"X"}]
[null,{"$f":"Indicadores!C5","v":0}]
[]
[null,"ACTIVO",null,null,null,null,"PASIVO"]
[]
[null,"Circulante",null,null,null,null,"Circulante"]
[]
[null,"Caja y Bancos",null,null,null,null,"Proveedores"]
[null,"Deudores x Servicio",null,null,null,null,"Acreedores Diversos"]
[null,"Deudores Diversos",null,null,null,null,"Docs. x Pagar c/plazo"]
[null,"Almacén",null,null,null,null,"Imp. y Derechos por Pagar"]
[null,"IVA Pagado",null,{"$f":"SUM(C15:C19)","v":0},{"$f":"IFERROR(D19/D36,0)","v":0},null,"Pagos anticipados",null,{"$f":"SUM(H15:H19)","v":0},{"$f":"IFERROR(I19/I36,0)","v":0}]
[]
[null,"Fijo",null,null,null,null,"Fijo"]
[]
[null,"Obras en Operación",null,null,null,null,"Docs. x Pagar l/plazo",null,{"$f":"H23","v":0},{"$f":"IFERROR(I23/I36,0)","v":0}]
[null,"Obras en Proceso"]
[null,"Edificios",null,null,null,null,"Suma del pasivo",null,{"$f":"SUM(I19:I23)","v":0},{"$f":"IFERROR(I25/I36,0)","v":0}]
[null,"Mobiliario y Equipo"]
[null,"Vehículos",null,{"$f":"SUM(C23:C27)","v":0},{"$f":"IFERROR(D27/D36,0)","v":0},null,"PATRIMONIO"]
[]
[null,null,null,null,null,null,"Patrimonio"]
[null,null,null,null,null,null,"Aportaciones Federales"]
[null,null,null,null,null,null,"Aportaciones Estatales"]
[null,"Diferido",null,null,null,null,"Aportaciones Municipales"]
[null,null,null,null,null,null,"Remanentes de Ej. Anterior"]
[null,"Pagos anticipados",null,{"$f":"C34","v":0},{"$f":"IFERROR(D34/D36,0)","v":0},null,"Remanentes del Ejercicio",null,{"$f":"SUM(H29:H34)","v":0},{"$f":"IFERROR(I34/I36,0)","v":0}]
[]
[null,"Suma del activo",null,{"$f":"SUM(D19:D35)","v":0},{"$f":"IFERROR(D36/D36,0)","v":0},null,"Suma del pasivo y el capital",null,{"$f":"SUM(I25:I35)","v":0},{"$f":"IFERROR(I36/I36,0)","v":0}]
[]
[]
[null,"NOTAS:"]

{"sheet":"NoPerceptible","index":20,"n_rows":69,"n_cols":13,"rows_kept":69,"cut":false,"hidden":false,"merged":[[3,2,3,8],[4,2,4,8],[6,1,6,12],[68,2,78,6],[8,1,47,1],[8,11,47,11],[8,12,47,12],[48,1,64,1],[48,11,64,11],[48,12,64,12]]}
[]
[null,"Formato 18. Determinación de las fugas no visibles"]
[]
[null,"NOMBRE:",{"$f":"+Datos!C4","v":"X"}]
[null,"AÑO:",{"$f":"+Datos!C5","v":0}]
[]
[null,"FUGAS NO VISIBLES"]
[null,"Sistema","Diametro (pul)","Orificio (mts)","Area (m2)","Presion (mca)","Caudal (m3/s)","Longitud (km)","Cantidad de Fugas","Volumen (m3/mes)","Volumen (m3/Año)","Volumen (m3/Año)","Porcentaje"]
[null,"Conduccion y Distribucion",null,{"$f":"(C9*(25.4/1000)*(1/10))","v":0},{"$f":"3.1415*POWER((D9/2),2)","v":0},null,{"$f":"E9*(SQRT(2*9.8*F9)^0.5)*0.013","v":0},null,{"$f":"0.8*NoPerceptible!H9","v":0},{"$f":"G9*(365*24*60*60/12)*I9","v":0},{"$f":"J9*12","v":0},{"$f":"SUM(K9:K48)","v":0},{"$f":"IFERROR(L9/(Datos!$E$29-Datos!$E$35),0)","v":0}]
[null,null,null,{"$f":"(C10*(25.4/1000)*(1/10))","v":0},0,null,{"$f":"E10*(SQRT(2*9.8*F10)^0.5)*0.013","v":0},null,{"$f":"0.8*NoPerceptible!H10","v":0},{"$f":"G10*(365*24*60*60/12)*I10","v":0},0]
[null,null,null,0,0,null,0,null,{"$f":"0.8*NoPerceptible!H11","v":0},0,0]
[null,null,null,0,0,null,0,null,{"$f":"0.8*NoPerceptible!H12","v":0},0,0]
[null,null,null,0,0,null,0,null,{"$f":"0.8*NoPerceptible!H13","v":0},0,0]
[null,null,null,0,0,null,0,null,{"$f":"0.8*NoPerceptible!H14","v":0},0,0]
[null,null,null,0,0,null,0,null,{"$f":"0.8*NoPerceptible!H15","v":0},0,0]
[null,null,null,0,{"$f":"3.1415*POWER((D16/2),2)","v":0},null,0,null,{"$f":"0.8*NoPerceptible!H16","v":0},0,{"$f":"J16*12","v":0}]
[null,null,null,0,0,null,0,null,{"$f":"0.8*NoPerceptible!H17","v":0},0,0]
[null,null,null,0,0,null,0,null,{"$f":"0.8*NoPerceptible!H18","v":0},0,0]
[null,null,null,0,0,null,0,null,{"$f":"0.8*NoPerceptible!H19","v":0},0,0]
[null,null,null,0,0,null,0,null,{"$f":"0.8*NoPerceptible!H20","v":0},0,0]
[null,null,null,0,0,null,0,null,{"$f":"0.8*NoPerceptible!H21","v":0},0,0]
[null,null,null,0,0,null,0,null,{"$f":"0.8*NoPerceptible!H22","v":0},0,0]
[null,null,null,0,0,null,0,null,{"$f":"0.8*NoPerceptible!H23","v":0},0,0]
[null,null,null,0,0,null,0,null,{"$f":"0.8*NoPerceptible!H24","v":0},0,0]
[null,null,null,0,0,null,0,null,{"$f":"0.8*NoPerceptible!H25","v":0},0,0]
[null,null,null,0,0,null,0,null,{"$f":"0.8*NoPerceptible!H26","v":0},0,0]
[null,null,null,0,{"$f":"3.1415*POWER((D27/2),2)","v":0},null,0,null,{"$f":"0.8*NoPerceptible!H27","v":0},0,{"$f":"J27*12","v":0}]
[null,null,null,0,{"$f":"3.1415*POWER((D28/2),2)","v":0},null,0,null,{"$f":"0.8*NoPerceptible!H28","v":0},0,{"$f":"J28*12","v":0}]
[null,null,null,0,{"$f":"3.1415*POWER((D29/2),2)","v":0},null,0,null,{"$f":"0.8*NoPerceptible!H29","v":0},0,{"$f":"J29*12","v":0}]
[null,null,null,0,0,null,0,null,{"$f":"0.8*NoPerceptible!H30","v":0},0,0]
[null,null,null,0,0,null,0,null,{"$f":"0.8*NoPerceptible!H31","v":0},0,0]
[null,null,null,0,0,null,0,null,{"$f":"0.8*NoPerceptible!H32","v":0},0,0]
[null,null,null,0,0,null,0,null,{"$f":"0.8*NoPerceptible!H33","v":0},0,0]
[null,null,null,0,0,null,0,null,{"$f":"0.8*NoPerceptible!H34","v":0},0,0]
[null,null,null,0,0,null,0,null,{"$f":"0.8*NoPerceptible!H35","v":0},0,0]
[null,null,null,0,0,null,0,null,{"$f":"0.8*NoPerceptible!H36","v":0},0,0]
[null,null,null,0,0,null,0,null,{"$f":"0.8*NoPerceptible!H37","v":0},0,0]
[null,null,null,0,{"$f":"3.1415*POWER((D38/2),2)","v":0},null,0,null,{"$f":"0.8*NoPerceptible!H38","v":0},0,{"$f":"J38*12","v":0}]
[null,null,null,0,0,null,0,null,{"$f":"0.8*NoPerceptible!H39","v":0},0,0]
[null,null,null,0,0,null,0,null,{"$f":"0.8*NoPerceptible!H40","v":0},0,0]
[null,null,null,0,0,null,0,null,{"$f":"0.8*NoPerceptible!H41","v":0},0,0]
[null,null,null,0,0,null,0,null,{"$f":"0.8*NoPerceptible!H42","v":0},0,0]
[null,null,null,0,0,null,0,null,{"$f":"0.8*NoPerceptible!H43","v":0},0,0]
[null,null,null,0,{"$f":"3.1415*POWER((D44/2),2)","v":0},null,0,null,{"$f":"0.8*NoPerceptible!H44","v":0},0,{"$f":"J44*12","v":0}]
[null,null,null,0,0,null,0,null,{"$f":"0.8*NoPerceptible!H45","v":0},0,0]
[null,null,null,0,0,null,0,null,{"$f":"0.8*NoPerceptible!H46","v":0},0,0]
[null,null,null,0,0,null,0,null,{"$f":"0.8*NoPerceptible!H47","v":0},0,0]
[null,null,null,0,0,null,0,null,{"$f":"0.8*NoPerceptible!H48","v":0},0,0]
[null,"Tomas",null,{"$f":"(C49*(25.4/1000)*(1/8))","v":0},0,null,{"$f":"E49*(SQRT(2*9.8*F49)^0.2)*0.013","v":0},null,{"$f":"5.6*NoPerceptible!H49","v":0},{"$f":"G49*(30*24*60*60)*I49","v":0},0,{"$f":"SUM(K49:K65)","v":0},{"$f":"IFERROR(L49/(Datos!$E$29-Datos!$E$35),0)","v":0}]
[null,null,null,{"$f":"(C50*(25.4/1000)*(1/8))","v":0},0,null,{"$f":"E50*(SQRT(2*9.8*F50)^0.2)*0.013","v":0},null,{"$f":"5.6*NoPerceptible!H50","v":0},{"$f":"G50*(30*24*60*60)*I50","v":0},0]
[null,null,null,0,0,null,0,null,{"$f":"5.6*NoPerceptible!H51","v":0},{"$f":"G51*(30*24*60*60)*I51","v":0},0]
[null,null,null,0,{"$f":"3.1415*POWER((D52/2),2)","v":0},null,0,null,{"$f":"5.6*NoPerceptible!H52","v":0},{"$f":"G52*(30*24*60*60)*I52","v":0},{"$f":"J52*12","v":0}]
[null,null,null,0,0,null,0,null,{"$f":"5.6*NoPerceptible!H53","v":0},0,0]
[null,null,null,0,0,null,0,null,{"$f":"5.6*NoPerceptible!H54","v":0},0,0]
[null,null,null,0,0,null,0,null,{"$f":"5.6*NoPerceptible!H55","v":0},0,0]
[null,null,null,0,0,null,0,null,{"$f":"5.6*NoPerceptible!H56","v":0},0,0]
[null,null,null,0,0,null,0,null,{"$f":"5.6*NoPerceptible!H57","v":0},0,0]
[null,null,null,0,0,null,0,null,{"$f":"5.6*NoPerceptible!H58","v":0},0,0]
[null,null,null,0,0,null,0,null,{"$f":"5.6*NoPerceptible!H59","v":0},0,0]
[null,null,null,0,{"$f":"3.1415*POWER((D60/2),2)","v":0},null,0,null,{"$f":"5.6*NoPerceptible!H60","v":0},{"$f":"G60*(30*24*60*60)*I60","v":0},{"$f":"J60*12","v":0}]
[null,null,null,0,0,null,0,null,{"$f":"5.6*NoPerceptible!H61","v":0},0,0]
[null,null,null,0,0,null,0,null,{"$f":"5.6*NoPerceptible!H62","v":0},0,0]
[null,null,null,0,0,null,0,null,{"$f":"5.6*NoPerceptible!H63","v":0},0,0]
[null,null,null,0,0,null,0,null,{"$f":"5.6*NoPerceptible!H64","v":0},0,0]
[null,null,null,0,0,null,0,null,{"$f":"5.6*NoPerceptible!H65","v":0},0,0]
[null,"Total",null,null,null,null,null,{"$f":"SUM(H9:H65)","v":0},null,null,"Total",{"$f":"SUM(L9:L65)","v":0},{"$f":"SUM(M9:M65)","v":0}]
[]
[]
[null,"NOTAS:"]

{"sheet":"PerdidasTanque","index":21,"n_rows":73,"n_cols":6,"rows_kept":73,"cut":false,"hidden":false,"merged":[[68,1,68,4],[72,2,82,6],[3,2,3,5],[4,2,4,5]]}
[]
[null,"Formato 19. Determinación de las fugas en tanques"]
[]
[null,"NOMBRE:",{"$f":"+Datos!C4","v":"X"}]
[null,"AÑO:",{"$f":"+Datos!C5","v":0}]
[]
[null,"Número","Tanque","Capacidad (m3)","perdidas de volumen por filtración (m3) x dia","perdidas de volumen por filtración (m3) x año"]
[null,null,null,null,{"$f":"((D8/5000)*0.01)*1440","v":0},{"$f":"E8*365","v":0}]
[null,null,null,null,{"$f":"((D9/5000)*0.01)*1440","v":0},{"$f":"E9*365","v":0}]
[null,null,null,null,0,0]
[null,null,null,null,0,0]
[null,null,null,null,0,0]
[null,null,null,null,0,0]
[null,null,null,null,0,0]
[null,null,null,null,{"$f":"((D15/5000)*0.01)*1440","v":0},{"$f":"E15*365","v":0}]
[null,null,null,null,0,0]
[null,null,null,null,0,0]
[null,null,null,null,0,0]
[null,null,null,null,0,0]
[null,null,null,null,0,0]
[null,null,null,null,0,0]
[null,null,null,null,0,0]
[null,null,null,null,0,0]
[null,null,null,null,0,0]
[null,null,null,null,0,0]
[null,null,null,null,0,0]
[null,null,null,null,0,0]
[null,null,null,null,0,0]
[null,null,null,null,0,0]
[null,null,null,null,0,0]
[null,null,null,null,0,0]
[null,null,null,null,0,0]
[null,null,null,null,0,0]
[null,null,null,null,0,0]
[null,null,null,null,0,0]
[null,null,null,null,0,0]
[null,null,null,null,0,0]
[null,null,null,null,0,0]
[null,null,null,null,0,0]
[null,null,null,null,0,0]
[null,null,null,null,0,0]
[null,null,null,null,0,0]
[null,null,null,null,0,0]
[null,null,null,null,0,0]
[null,null,null,null,0,0]
[null,null,null,null,0,0]
[null,null,null,null,0,0]
[null,null,null,null,0,0]
[null,null,null,null,0,0]
[null,null,null,null,0,0]
[null,null,null,null,0,0]
[null,null,null,null,0,0]
[null,null,null,null,0,0]
[null,null,null,null,0,0]
[null,null,null,null,0,0]
[null,null,null,null,0,0]
[null,null,null,null,0,0]
[null,null,null,null,0,0]
[null,null,null,null,0,0]
[null,null,null,null,0,0]
[null,null,null,null,0,0]
[null,null,null,null,0,0]
[null,null,null,null,0,0]
[null,null,null,null,0,0]
[null,null,null,null,0,0]
[null,null,null,null,0,0]
[null,null,null,null,0,0]
[null,null,null,null,0,0]
[null,"Total Pérdidas por Filtración",null,null,null,{"$f":"SUM(F8:F68)","v":0}]
[null,"Total ",{"$f":"+COUNTIF(D8:D68,\">0\")","v":0},{"$f":"+SUM(D8:D68)","v":0},"Porcentaje de Pérdidas",{"$f":"IFERROR(F69/(Datos!$E$29-Datos!$E$35),0)","v":0}]
[]
[]
[null,"NOTAS:"]

{"sheet":"Inversiones","index":22,"n_rows":36,"n_cols":6,"rows_kept":36,"cut":false,"hidden":false,"merged":[[6,1,6,5],[35,2,45,6],[3,2,3,7],[4,2,4,7]]}
[]
[null,"Formato 20. OTRAS INVERSIONES REQUERIDAS"]
[]
[null,"NOMBRE:",{"$f":"+Datos!C4","v":"X"}]
[null,"AÑO:",{"$f":"+Datos!C5","v":0}]
[]
[null,"INVERSIONES ADICIONALES"]
[null,"DESCRIPCION","Importe ($)","Acumulado","Prioridad","Año de Construcción"]
[null,null,null,{"$f":"+IF(C9>0,C9,0)","v":0},1,{"$f":"IF(C9=0,\"\",IF(SemblanzaF!D$67>Inversiones!D9,1,IF(SemblanzaF!E$67>Inversiones!D9,2,IF(SemblanzaF!F$67>Inversiones!D9,3,IF(SemblanzaF!G$67>Inversiones!D9,4,IF(SemblanzaF!H$67>Inversiones!D9,5,\"No entra\"))))))","v":""}]
[null,null,null,{"$f":"+IF(C10>0,C10+D9,0)","v":0},{"$f":"1+E9","v":2},{"$f":"IF(C10=0,\"\",IF(SemblanzaF!D$67>Inversiones!D10,1,IF(SemblanzaF!E$67>Inversiones!D10,2,IF(SemblanzaF!F$67>Inversiones!D10,3,IF(SemblanzaF!G$67>Inversiones!D10,4,IF(SemblanzaF!H$67>Inversiones!D10,5,\"No entra\"))))))","v":""}]
[null,null,null,{"$f":"+IF(C11>0,C11+D10,0)","v":0},{"$f":"1+E10","v":3},{"$f":"IF(C11=0,\"\",IF(SemblanzaF!D$67>Inversiones!D11,1,IF(SemblanzaF!E$67>Inversiones!D11,2,IF(SemblanzaF!F$67>Inversiones!D11,3,IF(SemblanzaF!G$67>Inversiones!D11,4,IF(SemblanzaF!H$67>Inversiones!D11,5,\"No entra\"))))))","v":""}]
[null,null,null,0,4,{"$f":"IF(C12=0,\"\",IF(SemblanzaF!D$67>Inversiones!D12,1,IF(SemblanzaF!E$67>Inversiones!D12,2,IF(SemblanzaF!F$67>Inversiones!D12,3,IF(SemblanzaF!G$67>Inversiones!D12,4,IF(SemblanzaF!H$67>Inversiones!D12,5,\"No entra\"))))))","v":""}]
[null,null,null,0,5,{"$f":"IF(C13=0,\"\",IF(SemblanzaF!D$67>Inversiones!D13,1,IF(SemblanzaF!E$67>Inversiones!D13,2,IF(SemblanzaF!F$67>Inversiones!D13,3,IF(SemblanzaF!G$67>Inversiones!D13,4,IF(SemblanzaF!H$67>Inversiones!D13,5,\"No entra\"))))))","v":""}]
[null,null,null,0,6,{"$f":"IF(C14=0,\"\",IF(SemblanzaF!D$67>Inversiones!D14,1,IF(SemblanzaF!E$67>Inversiones!D14,2,IF(SemblanzaF!F$67>Inversiones!D14,3,IF(SemblanzaF!G$67>Inversiones!D14,4,IF(SemblanzaF!H$67>Inversiones!D14,5,\"No entra\"))))))","v":""}]
[null,null,null,0,7,{"$f":"IF(C15=0,\"\",IF(SemblanzaF!D$67>Inversiones!D15,1,IF(SemblanzaF!E$67>Inversiones!D15,2,IF(SemblanzaF!F$67>Inversiones!D15,3,IF(SemblanzaF!G$67>Inversiones!D15,4,IF(SemblanzaF!H$67>Inversiones!D15,5,\"No entra\"))))))","v":""}]
[null,null,null,0,8,{"$f":"IF(C16=0,\"\",IF(SemblanzaF!D$67>Inversiones!D16,1,IF(SemblanzaF!E$67>Inversiones!D16,2,IF(SemblanzaF!F$67>Inversiones!D16,3,IF(SemblanzaF!G$67>Inversiones!D16,4,IF(SemblanzaF!H$67>Inversiones!D16,5,\"No entra\"))))))","v":""}]
[null,null,null,0,9,{"$f":"IF(C17=0,\"\",IF(SemblanzaF!D$67>Inversiones!D17,1,IF(SemblanzaF!E$67>Inversiones!D17,2,IF(SemblanzaF!F$67>Inversiones!D17,3,IF(SemblanzaF!G$67>Inversiones!D17,4,IF(SemblanzaF!H$67>Inversiones!D17,5,\"No entra\"))))))","v":""}]
[null,null,null,{"$f":"+IF(C18>0,C18+D17,0)","v":0},10,{"$f":"IF(C18=0,\"\",IF(SemblanzaF!D$67>Inversiones!D18,1,IF(SemblanzaF!E$67>Inversiones!D18,2,IF(SemblanzaF!F$67>Inversiones!D18,3,IF(SemblanzaF!G$67>Inversiones!D18,4,IF(SemblanzaF!H$67>Inversiones!D18,5,\"No entra\"))))))","v":""}]
[null,null,null,0,11,{"$f":"IF(C19=0,\"\",IF(SemblanzaF!D$67>Inversiones!D19,1,IF(SemblanzaF!E$67>Inversiones!D19,2,IF(SemblanzaF!F$67>Inversiones!D19,3,IF(SemblanzaF!G$67>Inversiones!D19,4,IF(SemblanzaF!H$67>Inversiones!D19,5,\"No entra\"))))))","v":""}]
[null,null,null,0,12,{"$f":"IF(C20=0,\"\",IF(SemblanzaF!D$67>Inversiones!D20,1,IF(SemblanzaF!E$67>Inversiones!D20,2,IF(SemblanzaF!F$67>Inversiones!D20,3,IF(SemblanzaF!G$67>Inversiones!D20,4,IF(SemblanzaF!H$67>Inversiones!D20,5,\"No entra\"))))))","v":""}]
[null,null,null,0,13,{"$f":"IF(C21=0,\"\",IF(SemblanzaF!D$67>Inversiones!D21,1,IF(SemblanzaF!E$67>Inversiones!D21,2,IF(SemblanzaF!F$67>Inversiones!D21,3,IF(SemblanzaF!G$67>Inversiones!D21,4,IF(SemblanzaF!H$67>Inversiones!D21,5,\"No entra\"))))))","v":""}]
[null,null,null,0,14,{"$f":"IF(C22=0,\"\",IF(SemblanzaF!D$67>Inversiones!D22,1,IF(SemblanzaF!E$67>Inversiones!D22,2,IF(SemblanzaF!F$67>Inversiones!D22,3,IF(SemblanzaF!G$67>Inversiones!D22,4,IF(SemblanzaF!H$67>Inversiones!D22,5,\"No entra\"))))))","v":""}]
[null,null,null,0,15,{"$f":"IF(C23=0,\"\",IF(SemblanzaF!D$67>Inversiones!D23,1,IF(SemblanzaF!E$67>Inversiones!D23,2,IF(SemblanzaF!F$67>Inversiones!D23,3,IF(SemblanzaF!G$67>Inversiones!D23,4,IF(SemblanzaF!H$67>Inversiones!D23,5,\"No entra\"))))))","v":""}]
[null,null,null,0,16,{"$f":"IF(C24=0,\"\",IF(SemblanzaF!D$67>Inversiones!D24,1,IF(SemblanzaF!E$67>Inversiones!D24,2,IF(SemblanzaF!F$67>Inversiones!D24,3,IF(SemblanzaF!G$67>Inversiones!D24,4,IF(SemblanzaF!H$67>Inversiones!D24,5,\"No entra\"))))))","v":""}]
[null,null,null,0,17,{"$f":"IF(C25=0,\"\",IF(SemblanzaF!D$67>Inversiones!D25,1,IF(SemblanzaF!E$67>Inversiones!D25,2,IF(SemblanzaF!F$67>Inversiones!D25,3,IF(SemblanzaF!G$67>Inversiones!D25,4,IF(SemblanzaF!H$67>Inversiones!D25,5,\"No entra\"))))))","v":""}]
[null,null,null,0,18,{"$f":"IF(C26=0,\"\",IF(SemblanzaF!D$67>Inversiones!D26,1,IF(SemblanzaF!E$67>Inversiones!D26,2,IF(SemblanzaF!F$67>Inversiones!D26,3,IF(SemblanzaF!G$67>Inversiones!D26,4,IF(SemblanzaF!H$67>Inversiones!D26,5,\"No entra\"))))))","v":""}]
[null,null,null,0,19,{"$f":"IF(C27=0,\"\",IF(SemblanzaF!D$67>Inversiones!D27,1,IF(SemblanzaF!E$67>Inversiones!D27,2,IF(SemblanzaF!F$67>Inversiones!D27,3,IF(SemblanzaF!G$67>Inversiones!D27,4,IF(SemblanzaF!H$67>Inversiones!D27,5,\"No entra\"))))))","v":""}]
[null,null,null,0,20,{"$f":"IF(C28=0,\"\",IF(SemblanzaF!D$67>Inversiones!D28,1,IF(SemblanzaF!E$67>Inversiones!D28,2,IF(SemblanzaF!F$67>Inversiones!D28,3,IF(SemblanzaF!G$67>Inversiones!D28,4,IF(SemblanzaF!H$67>Inversiones!D28,5,\"No entra\"))))))","v":""}]
[null,null,null,0,21,{"$f":"IF(C29=0,\"\",IF(SemblanzaF!D$67>Inversiones!D29,1,IF(SemblanzaF!E$67>Inversiones!D29,2,IF(SemblanzaF!F$67>Inversiones!D29,3,IF(SemblanzaF!G$67>Inversiones!D29,4,IF(SemblanzaF!H$67>Inversiones!D29,5,\"No entra\"))))))","v":""}]
[null,null,null,0,22,{"$f":"IF(C30=0,\"\",IF(SemblanzaF!D$67>Inversiones!D30,1,IF(SemblanzaF!E$67>Inversiones!D30,2,IF(SemblanzaF!F$67>Inversiones!D30,3,IF(SemblanzaF!G$67>Inversiones!D30,4,IF(SemblanzaF!H$67>Inversiones!D30,5,\"No entra\"))))))","v":""}]
[null,null,null,0,23,{"$f":"IF(C31=0,\"\",IF(SemblanzaF!D$67>Inversiones!D31,1,IF(SemblanzaF!E$67>Inversiones!D31,2,IF(SemblanzaF!F$67>Inversiones!D31,3,IF(SemblanzaF!G$67>Inversiones!D31,4,IF(SemblanzaF!H$67>Inversiones!D31,5,\"No entra\"))))))","v":""}]
[null,null,null,0,24,{"$f":"IF(C32=0,\"\",IF(SemblanzaF!D$67>Inversiones!D32,1,IF(SemblanzaF!E$67>Inversiones!D32,2,IF(SemblanzaF!F$67>Inversiones!D32,3,IF(SemblanzaF!G$67>Inversiones!D32,4,IF(SemblanzaF!H$67>Inversiones!D32,5,\"No entra\"))))))","v":""}]
[null,"Total",{"$f":"SUM(C9:C32)","v":0}]
[]
[]
[null,"NOTAS:"]

{"sheet":"Parametros","index":23,"n_rows":39,"n_cols":4,"rows_kept":39,"cut":false,"hidden":false,"merged":[[3,2,3,10],[4,2,4,10]]}
[]
[null,"Formato 21. PARAMETROS DE SEMAFORIZACION"]
[]
[null,"NOMBRE:",{"$f":"+Datos!C4","v":"X"}]
[null,"AÑO:",{"$f":"+Datos!C5","v":0}]
[]
[null,"CONCEPTOS","Menor","Mayor"]
[null,"Empleados por cada 1 000 tomas",4,6]
[null,"Eficiencia Física",0.6,0.75]
[null,"Cobertura de agua potable",0.9,1]
[null,"Cobertura micromedición",0.85,0.95]
[null,"% de usuarios con servicio continuo",0.6,1]
[null,"$ Facturado por m3 suministrado",10,15]
[null,"Eficiencia comercial (monetaria)",0.7,0.9]
[null,"% Energía Eléctrica",0.05,0.1]
[null,"% Gasto de Personal",0.4,0.6]
[null,"% empleados operativo",0.3,0.5]
[null,"% de Macromedición",0.8,0.9]
[null,"Porcentaje de Tolerancia de Cuota Fija",0.9,1.1000000000000001]
[null,"Medidores con mas de 5 años de antigüdad",0.6,0.8]
[null,"Calidad de la Información",4,6]
[null,"Porcentaje de reposición",5.0000000000000001E-3,0.01]
[null,"Valor de la infraestructura por toma en USD",1500,2500]
[null,"% de Agua tratada respecto a Agua Facturada",0.8,1.1000000000000001]
[null,"Factor de clandestinaje",0.4,0.6]
[null,"Relación Tarifas otros usos y domésticas",1.5,2.5]
[null,"Eficiencia de la Lectura",0.9,0.95]
[null,"Factor de Carga",0.7,0.9]
[null,"Factor de Potencia",0.6,0.8]
[null,"Consumo de EE en Punta",0.1,0.3]
[null,"Pérdidas en Tanques",0,0.01]
[null,"Pérdidas en Red",0,0.05]
[null,"Pérdidas Comerciales",0.3,0.5]
[null,"Calidad/confiabilidad de la sectorización",7,10]
[null,"% de Financiamiento sobre ingresos",0.1,0.3]
[null,"AÑO",2016,2020]
[null,"MES HASTA QUE PUEDE INVERTIR MISMO AÑO",1,9]
[null,"% de otros gastos sobre gastos totales a justificar",0,0.2]
[null,"Tolerancia Pérdidas Comerciales",0.2,0.75]

{"sheet":"Indice Evaluacion","index":24,"n_rows":15,"n_cols":3,"rows_kept":15,"cut":false,"hidden":true,"merged":[[1,1,1,2],[14,1,14,2]]}
[]
[null,"INDICE EVALUACION"]
[null,"CONTENIDO","HOJA"]
[null,"Formato Evaluación 1. DATOS BASICOS PARA EVALUACION","Datos básicos"]
[null,"Formato Evaluación 2. ACCIONES A CONSIDERAR EN EL PDI","Acciones a Ejecutar"]
[null,"Formato Evaluación 3. BENEFICIOS DE LAS ACCIONES A CONSIDERAR EN EL PDI","Premisas Beneficios"]
[null,"Formato Evaluación 4. INVERSIONES DE LAS ACCIONES A CONSIDERAR EN EL PDI","Premisas Inversiones"]
[null,"Formato Evaluación 5. GASTOS OPERACIONALES ADICIONALES DE LAS ACCIONES A CONSIDERAR EN EL PDI","Premisas OPEX"]
[null,"Formato Evaluación 6. EVALUACION DE LOS PDI - FLUJOS LIBRES DE CAJA","Detalle evaluación"]
[null,"Formato Evaluación 7. EVALUACION DE LOS PDI - RESULTADOS","Evaluación"]
[null,"Formato Evaluación 8. EVALUACION DE LOS PDI - CALENDARIZACION (PRIORIZACION)","Calendarización"]
[null,"Formato Evaluación 9. PARAMETROS","Parámetros Evaluación"]
[null,"Formato Evaluación 10. PROYECCIONES PARA EVALUACION","Proyecciones Base"]
[null,"Formato Evaluación 11. PRECIOS","Precios"]
[null,"NOTA : Si necesita insertar una fila dentro de alguna planilla hagalo en una fila al centro de ella"]

{"sheet":"Datos basicos","index":25,"n_rows":37,"n_cols":11,"rows_kept":37,"cut":false,"hidden":true,"merged":[[3,1,3,4],[4,1,4,4],[29,7,29,10]]}
[]
["Formato Evaluación 1. DATOS BASICOS PARA EVALUACION"]
[]
["NOMBRE:",{"$f":"+Datos!$C$4","v":"X"}]
["Año Base",{"$f":"+Datos!$C$5","v":0}]
[]
["Variables","Valor"]
["Tasa de Descuento",0.1]
["% Total de Aumento de la facturación en m3",{"$f":"+'Premisas Beneficios'!E11+'Premisas Beneficios'!C24+'Premisas Beneficios'!C30+'Premisas Beneficios'!E31+'Premisas Beneficios'!C42","v":0}]
["Aumento de tarifas Cuota Fija",{"$f":"+'Premisas Beneficios'!C33+'Premisas Beneficios'!C34+'Premisas Beneficios'!C23","v":0}]
["Aumento de tarifas Servicio Medido",{"$f":"+'Premisas Beneficios'!C33+'Premisas Beneficios'!C34","v":0}]
["Aumento de tomas",{"$f":"+'Premisas Beneficios'!C31+'Premisas Beneficios'!C32","v":0}]
["Aumento eficiencia Comercial",{"$f":"+'Premisas Beneficios'!C25+'Premisas Beneficios'!C26+'Premisas Beneficios'!C27+'Premisas Beneficios'!C28+'Premisas Beneficios'!C29","v":0}]
["Meta eficiencia Comercial",{"$f":"+MIN(B13+'Proyecciones Base'!C17,'Parametros Evaluacion'!D16)","v":0}]
["Aumento de eficiencia física",{"$f":"+'Premisas Beneficios'!C39+'Premisas Beneficios'!C40+'Premisas Beneficios'!C41+'Premisas Beneficios'!C43+'Premisas Beneficios'!C44+'Premisas Beneficios'!C45+'Premisas Beneficios'!C46+'Premisas Beneficios'!C47+'Premisas Beneficios'!C48+'Premisas Beneficios'!C49+'Premisas Beneficios'!C50","v":0}]
["Meta eficiencia Física",{"$f":"+MIN('Proyecciones Base'!C28*1.3,0.75,B15+'Proyecciones Base'!C28)","v":0}]
["Mejora de eficiencia Energética",{"$f":"+SUM('Premisas Beneficios'!C8:C14)","v":0}]
["Gasto de Producción por m3",{"$f":"+IFERROR((Costos!$C$31+Costos!$C$33+Costos!$C$35)/Datos!$E$29,0)","v":0}]
["Capacidad instalada en lps",{"$f":"+Produccion!$G$159","v":0}]
["Gasto de infraestructura a renovar por l/s",{"$f":"+IFERROR(Datos!$E$70*Datos!$E$72*Datos!$E$12/Produccion!$G$159,0)","v":0}]
["Cobertura AP",{"$f":"+Indicadores!$D$9","v":0}]
["Cobertura AR",{"$f":"+Indicadores!$D$10","v":0}]
["Indice de hacinamiento",{"$f":"+'Tomas y coberturas'!M9","v":0}]
["Gastos de Personal",{"$f":"+Costos!$C$30","v":0}]
["# de Empleados",{"$f":"+Empleados!$C$22","v":0}]
["Empleados por mil tomas base",{"$f":"+Indicadores!$D$28","v":0}]
["Empleados por mil tomas meta",{"$f":"+Indicadores!$D$28-'Premisas Beneficios'!C18-'Premisas Beneficios'!C19-'Premisas Beneficios'!C20","v":0}]
["Gasto por empleado",{"$f":"+Indicadores!$D$29","v":0}]
["Tamaño del Organismo",{"$f":"+IF('Proyecciones Base'!C20<15000,1,IF('Proyecciones Base'!C20<100000,2,IF('Proyecciones Base'!C20<500000,3,4)))","v":1}]
[null,null,null,null,null,null,null,"TAMAÑO DEL ORGANISMO"]
["APORTE PRODI",{"$f":"+Datos!C6+1","v":1},{"$f":"+B31+1","v":2},{"$f":"+C31+1","v":3},{"$f":"+D31+1","v":4},{"$f":"+E31+1","v":5},null,1,2,3,4]
["Agua Potable",{"$f":"+HLOOKUP($B$29,$H$31:$K$37,2,0)","v":0.5},{"$f":"+HLOOKUP($B$29,$H$31:$K$37,2,0)","v":0.5},{"$f":"+HLOOKUP($B$29,$H$31:$K$37,2,0)","v":0.5},{"$f":"+HLOOKUP($B$29,$H$31:$K$37,2,0)","v":0.5},{"$f":"+HLOOKUP($B$29,$H$31:$K$37,2,0)","v":0.5},null,0.5,0.5,0.5,0.5]
["Alcantarillado",{"$f":"+HLOOKUP($B$29,$H$31:$K$37,3,0)","v":0.5},{"$f":"+HLOOKUP($B$29,$H$31:$K$37,3,0)","v":0.5},{"$f":"+HLOOKUP($B$29,$H$31:$K$37,3,0)","v":0.5},{"$f":"+HLOOKUP($B$29,$H$31:$K$37,3,0)","v":0.5},{"$f":"+HLOOKUP($B$29,$H$31:$K$37,3,0)","v":0.5},null,0.5,0.5,0.5,0.5]
["Mejoramiento Ef. Física",{"$f":"+HLOOKUP($B$29,$H$31:$K$37,4,0)","v":0.5},{"$f":"+HLOOKUP($B$29,$H$31:$K$37,4,0)","v":0.5},{"$f":"+HLOOKUP($B$29,$H$31:$K$37,4,0)","v":0.5},{"$f":"+HLOOKUP($B$29,$H$31:$K$37,4,0)","v":0.5},{"$f":"+HLOOKUP($B$29,$H$31:$K$37,4,0)","v":0.5},null,0.5,0.5,0.5,0.5]
["Mejoramiento Ef. Comercial",{"$f":"+HLOOKUP($B$29,$H$31:$K$37,5,0)","v":0.5},{"$f":"+HLOOKUP($B$29,$H$31:$K$37,5,0)","v":0.5},{"$f":"+HLOOKUP($B$29,$H$31:$K$37,5,0)","v":0.5},{"$f":"+HLOOKUP($B$29,$H$31:$K$37,5,0)","v":0.5},{"$f":"+HLOOKUP($B$29,$H$31:$K$37,5,0)","v":0.5},null,0.5,0.5,0.5,0.5]
["Rehabilitaciones",{"$f":"+HLOOKUP($B$29,$H$31:$K$37,6,0)","v":0.4},{"$f":"+HLOOKUP($B$29,$H$31:$K$37,6,0)","v":0.4},{"$f":"+HLOOKUP($B$29,$H$31:$K$37,6,0)","v":0.4},{"$f":"+HLOOKUP($B$29,$H$31:$K$37,6,0)","v":0.4},{"$f":"+HLOOKUP($B$29,$H$31:$K$37,6,0)","v":0.4},null,0.4,0.4,0.4,0.4]
["Estudios y Proyectos",{"$f":"+HLOOKUP($B$29,$H$31:$K$37,7,0)","v":0.5},{"$f":"+HLOOKUP($B$29,$H$31:$K$37,7,0)","v":0.5},{"$f":"+HLOOKUP($B$29,$H$31:$K$37,7,0)","v":0.5},{"$f":"+HLOOKUP($B$29,$H$31:$K$37,7,0)","v":0.5},{"$f":"+HLOOKUP($B$29,$H$31:$K$37,7,0)","v":0.5},null,0.5,0.5,0.5,0.5]

{"sheet":"Acciones a Ejecutar","index":26,"n_rows":58,"n_cols":5,"rows_kept":58,"cut":false,"hidden":true,"merged":[[4,1,4,5]]}
[]
["Formato Evaluación 2. ACCIONES A CONSIDERAR EN EL PDI"]
[]
["NOMBRE:",{"$f":"+Datos!$C$4","v":"X"}]
["AÑO:",{"$f":"+Datos!$C$5","v":0}]
[]
["1. PAI para reducir gastos de energía eléctrica","Se Incorpora","COMENTARIO","Cantidades","JUSTIFICACION"]
[{"$f":"+Acciones!C8","v":"Solicitud de cambio de tarifa eléctrica para reducir gasto por concepto de energía eléctrica."},null,{"$f":"+IF(AND(B8=\"si\",Acciones!I8=\"SI\"),\"OK\",IF(AND(B8=\"NO\",Acciones!I8=\"NO\"),\"OK\",\"JUSTIFICAR\"))","v":"JUSTIFICAR"}]
[{"$f":"+Acciones!C9","v":"Reducción de la potencia reactiva (reducción del factor de potencia)"},null,{"$f":"+IF(AND(B9=\"si\",Acciones!I9=\"SI\"),\"OK\",IF(AND(B9=\"NO\",Acciones!I9=\"NO\"),\"OK\",\"JUSTIFICAR\"))","v":"JUSTIFICAR"}]
[{"$f":"+Acciones!C10","v":"Sustitución de equipos de bombeo de agua potable para reducir consumo de energía"},null,{"$f":"+IF(AND(B10=\"si\",Acciones!I10=\"SI\"),\"OK\",IF(AND(B10=\"NO\",Acciones!I10=\"NO\"),\"OK\",\"JUSTIFICAR\"))","v":"JUSTIFICAR"},0]
[{"$f":"+Acciones!C11","v":"Sustitución o construcción de tanques de almacenamiento de agua para modificar políticas de operación del equipo de bombeo"},null,{"$f":"+IF(AND(B11=\"si\",Acciones!I11=\"SI\"),\"OK\",IF(AND(B11=\"NO\",Acciones!I11=\"NO\"),\"OK\",\"JUSTIFICAR\"))","v":"JUSTIFICAR"},0]
[{"$f":"+Acciones!C12","v":"Automatización de equipos de bombeo para modificar políticas de operación"},null,{"$f":"+IF(AND(B12=\"si\",Acciones!I12=\"SI\"),\"OK\",IF(AND(B12=\"NO\",Acciones!I12=\"NO\"),\"OK\",\"JUSTIFICAR\"))","v":"JUSTIFICAR"},0]
[{"$f":"+Acciones!C13","v":"Sustitución de bombas de alcantarillado"},null,{"$f":"+IF(AND(B13=\"si\",Acciones!I13=\"SI\"),\"OK\",IF(AND(B13=\"NO\",Acciones!I13=\"NO\"),\"OK\",\"JUSTIFICAR\"))","v":"JUSTIFICAR"},0]
[{"$f":"+Acciones!C14","v":"Reducción de gastos de energía en plantas de tratamiento de aguas residuales (PTAR)"},null,{"$f":"+IF(AND(B14=\"si\",Acciones!I14=\"SI\"),\"OK\",IF(AND(B14=\"NO\",Acciones!I14=\"NO\"),\"OK\",\"JUSTIFICAR\"))","v":"JUSTIFICAR"}]
[{"$f":"+Acciones!C15","v":"Elaboración de una auditoría energética"},null,{"$f":"+IF(AND(B15=\"si\",Acciones!I15=\"SI\"),\"OK\",IF(AND(B15=\"NO\",Acciones!I15=\"NO\"),\"OK\",\"JUSTIFICAR\"))","v":"JUSTIFICAR"}]
["Total Inversión PAI para reducción de gastos de energía eléctrica"]
["2. PAI para incrementar la productividad del personal "]
[{"$f":"+Acciones!C16","v":"Programa de capacitación y profesionalización para incrementar la productividad del personal."},null,{"$f":"+IF(AND(B18=\"si\",Acciones!I16=\"SI\"),\"OK\",IF(AND(B18=\"NO\",Acciones!I16=\"NO\"),\"OK\",\"JUSTIFICAR\"))","v":"JUSTIFICAR"}]
[{"$f":"+Acciones!C17","v":"Revisión del manual de funciones y cargos del personal del OO"},null,{"$f":"+IF(AND(B19=\"si\",Acciones!I17=\"SI\"),\"OK\",IF(AND(B19=\"NO\",Acciones!I17=\"NO\"),\"OK\",\"JUSTIFICAR\"))","v":"JUSTIFICAR"}]
[{"$f":"+Acciones!C18","v":"Establecimiento de un programa de retiro voluntario y obligado"},null,{"$f":"+IF(AND(B20=\"si\",Acciones!I18=\"SI\"),\"OK\",IF(AND(B20=\"NO\",Acciones!I18=\"NO\"),\"OK\",\"JUSTIFICAR\"))","v":"JUSTIFICAR"}]
["Total Inversión PAI para incrementar la productividad del personal"]
["3. PAI para mejora de la Gestión Comercial"]
[{"$f":"+Acciones!C19","v":"Ajuste de consumos de cuota fija"},null,{"$f":"+IF(AND(B23=\"si\",Acciones!I19=\"SI\"),\"OK\",IF(AND(B23=\"NO\",Acciones!I19=\"NO\"),\"OK\",\"JUSTIFICAR\"))","v":"JUSTIFICAR"}]
[{"$f":"+Acciones!C20","v":"Corrección de errores de micromedición mediante sustitución de medidores."},null,{"$f":"+IF(AND(B24=\"si\",Acciones!I20=\"SI\"),\"OK\",IF(AND(B24=\"NO\",Acciones!I20=\"NO\"),\"OK\",\"JUSTIFICAR\"))","v":"JUSTIFICAR"}]
[{"$f":"+Acciones!C21","v":"Impartición de cursos de formación de recursos humanos en eficiencia comercial"},null,{"$f":"+IF(AND(B25=\"si\",Acciones!I21=\"SI\"),\"OK\",IF(AND(B25=\"NO\",Acciones!I21=\"NO\"),\"OK\",\"JUSTIFICAR\"))","v":"JUSTIFICAR"}]
[{"$f":"+Acciones!C22","v":"Impartición de cursos de formación de recursos humanos en atención a usuarios"},null,{"$f":"+IF(AND(B26=\"si\",Acciones!I22=\"SI\"),\"OK\",IF(AND(B26=\"NO\",Acciones!I22=\"NO\"),\"OK\",\"JUSTIFICAR\"))","v":"JUSTIFICAR"}]
[{"$f":"+Acciones!C23","v":"Firma de convenios con bancos y otras instituciones para ampliar las opciones de pago de los servicios de agua y saneamiento"},null,{"$f":"+IF(AND(B27=\"si\",Acciones!I23=\"SI\"),\"OK\",IF(AND(B27=\"NO\",Acciones!I23=\"NO\"),\"OK\",\"JUSTIFICAR\"))","v":"JUSTIFICAR"}]
[{"$f":"+Acciones!C24","v":"Mejoras a la facturación mediante un nuevo sistema comercial"},null,{"$f":"+IF(AND(B28=\"si\",Acciones!I24=\"SI\"),\"OK\",IF(AND(B28=\"NO\",Acciones!I24=\"NO\"),\"OK\",\"JUSTIFICAR\"))","v":"JUSTIFICAR"}]
[{"$f":"+Acciones!C25","v":"Mejoras en la cobranza mediante esquemas que faciliten el pago."},null,{"$f":"+IF(AND(B29=\"si\",Acciones!I25=\"SI\"),\"OK\",IF(AND(B29=\"NO\",Acciones!I25=\"NO\"),\"OK\",\"JUSTIFICAR\"))","v":"JUSTIFICAR"}]
[{"$f":"+Acciones!C26","v":"Localización y regularización de tomas clandestinas"},null,{"$f":"+IF(AND(B30=\"si\",Acciones!I26=\"SI\"),\"OK\",IF(AND(B30=\"NO\",Acciones!I26=\"NO\"),\"OK\",\"JUSTIFICAR\"))","v":"JUSTIFICAR"}]
[{"$f":"+Acciones!C27","v":"Censo de usuarios para mejorar el padrón. Establecimiento de esquemas de actualización continua del padrón."},null,{"$f":"+IF(AND(B31=\"si\",Acciones!I27=\"SI\"),\"OK\",IF(AND(B31=\"NO\",Acciones!I27=\"NO\"),\"OK\",\"JUSTIFICAR\"))","v":"JUSTIFICAR"}]
[{"$f":"+Acciones!C28","v":"Sistema de cómputo para altas y bajas del padrón de usuarios."},null,{"$f":"+IF(AND(B32=\"si\",Acciones!I28=\"SI\"),\"OK\",IF(AND(B32=\"NO\",Acciones!I28=\"NO\"),\"OK\",\"JUSTIFICAR\"))","v":"JUSTIFICAR"}]
[{"$f":"+Acciones!C29","v":"Estudio tarifario con el fin de realizar la actualización de las tarifas de agua"},null,{"$f":"+IF(AND(B33=\"si\",Acciones!I29=\"SI\"),\"OK\",IF(AND(B33=\"NO\",Acciones!I29=\"NO\"),\"OK\",\"JUSTIFICAR\"))","v":"JUSTIFICAR"}]
[{"$f":"+Acciones!C30","v":"Modificaciones a la estructura tarifaria"},null,{"$f":"+IF(AND(B34=\"si\",Acciones!I30=\"SI\"),\"OK\",IF(AND(B34=\"NO\",Acciones!I30=\"NO\"),\"OK\",\"JUSTIFICAR\"))","v":"JUSTIFICAR"}]
[{"$f":"+Acciones!C31","v":"Reformas para lograr que las tarifas se actualicen de manera continua"},null,{"$f":"+IF(AND(B35=\"si\",Acciones!I31=\"SI\"),\"OK\",IF(AND(B35=\"NO\",Acciones!I31=\"NO\"),\"OK\",\"JUSTIFICAR\"))","v":"JUSTIFICAR"}]
[{"$f":"+Acciones!C32","v":"Reformas al marco legal para que el OO pueda establecer tarifas adecuadas"},null,{"$f":"+IF(AND(B36=\"si\",Acciones!I32=\"SI\"),\"OK\",IF(AND(B36=\"NO\",Acciones!I32=\"NO\"),\"OK\",\"JUSTIFICAR\"))","v":"JUSTIFICAR"}]
["Total PAI para mejora de la Gestión Comercial"]
["4. PAI para reducción de Pérdidas Físicas de Agua"]
[{"$f":"+Acciones!C33","v":"Localización y reparación de fugas en tanques"},null,{"$f":"+IF(AND(B39=\"si\",Acciones!I33=\"SI\"),\"OK\",IF(AND(B39=\"NO\",Acciones!I33=\"NO\"),\"OK\",\"JUSTIFICAR\"))","v":"JUSTIFICAR"}]
[{"$f":"+Acciones!C34","v":"Localización y reparación de fugas en tuberías principales y secundarias"},null,{"$f":"+IF(AND(B40=\"si\",Acciones!I34=\"SI\"),\"OK\",IF(AND(B40=\"NO\",Acciones!I34=\"NO\"),\"OK\",\"JUSTIFICAR\"))","v":"JUSTIFICAR"}]
[{"$f":"+Acciones!C35","v":"Instalación de micromedidores en las tomas"},null,{"$f":"+IF(AND(B41=\"si\",Acciones!I35=\"SI\"),\"OK\",IF(AND(B41=\"NO\",Acciones!I35=\"NO\"),\"OK\",\"JUSTIFICAR\"))","v":"JUSTIFICAR"}]
[{"$f":"+Acciones!C36","v":"Sistematización de lectura de micromedidores en tomas e incorporación de lecturas al sistema de facturación y cobranza"},null,{"$f":"+IF(AND(B42=\"si\",Acciones!I36=\"SI\"),\"OK\",IF(AND(B42=\"NO\",Acciones!I36=\"NO\"),\"OK\",\"JUSTIFICAR\"))","v":"JUSTIFICAR"}]
[{"$f":"+Acciones!C37","v":"Optimización hidráulica: sectorización de la red de distribución, control de presión, optimización de la capacidad de almacenamiento."},null,{"$f":"+IF(AND(B43=\"si\",Acciones!I37=\"SI\"),\"OK\",IF(AND(B43=\"NO\",Acciones!I37=\"NO\"),\"OK\",\"JUSTIFICAR\"))","v":"JUSTIFICAR"}]
[{"$f":"+Acciones!C38","v":"Catastro de infraestructura hidráulica y de redes"},null,{"$f":"+IF(AND(B44=\"si\",Acciones!I38=\"SI\"),\"OK\",IF(AND(B44=\"NO\",Acciones!I38=\"NO\"),\"OK\",\"JUSTIFICAR\"))","v":"JUSTIFICAR"}]
[{"$f":"+Acciones!C39","v":"Instalación de macromedidores en captaciones"},null,{"$f":"+IF(AND(B45=\"si\",Acciones!I39=\"SI\"),\"OK\",IF(AND(B45=\"NO\",Acciones!I39=\"NO\"),\"OK\",\"JUSTIFICAR\"))","v":"JUSTIFICAR"}]
[{"$f":"+Acciones!C40","v":"Instalación de macromedidores en sectores"},null,{"$f":"+IF(AND(B46=\"si\",Acciones!I40=\"SI\"),\"OK\",IF(AND(B46=\"NO\",Acciones!I40=\"NO\"),\"OK\",\"JUSTIFICAR\"))","v":"JUSTIFICAR"}]
[{"$f":"+Acciones!C41","v":"Sistematización de lectura de macromedidores en captaciones y sectores ( p.ej. a través de telemetría)"},null,{"$f":"+IF(AND(B47=\"si\",Acciones!I41=\"SI\"),\"OK\",IF(AND(B47=\"NO\",Acciones!I41=\"NO\"),\"OK\",\"JUSTIFICAR\"))","v":"JUSTIFICAR"}]
[{"$f":"+Acciones!C42","v":"Sustitución de tuberías con alto índice de fugas"},null,{"$f":"+IF(AND(B48=\"si\",Acciones!I42=\"SI\"),\"OK\",IF(AND(B48=\"NO\",Acciones!I42=\"NO\"),\"OK\",\"JUSTIFICAR\"))","v":"JUSTIFICAR"}]
[{"$f":"+Acciones!C43","v":"Capacitación del personal del OO en operación de equipos"},null,{"$f":"+IF(AND(B49=\"si\",Acciones!I43=\"SI\"),\"OK\",IF(AND(B49=\"NO\",Acciones!I43=\"NO\"),\"OK\",\"JUSTIFICAR\"))","v":"JUSTIFICAR"}]
[{"$f":"+Acciones!C44","v":"Sistema de Información Geográfica"},null,{"$f":"+IF(AND(B50=\"si\",Acciones!I44=\"SI\"),\"OK\",IF(AND(B50=\"NO\",Acciones!I44=\"NO\"),\"OK\",\"JUSTIFICAR\"))","v":"JUSTIFICAR"}]
["Total PAI para reducción de Pérdidas Físicas de Agua"]
["5. PAI para sostenibilidad a las acciones "]
[{"$f":"+Acciones!C45","v":"Establecimiento de un comité ciudadano del organismo operador"},null,{"$f":"+IF(AND(B53=\"si\",Acciones!I45=\"SI\"),\"OK\",IF(AND(B53=\"NO\",Acciones!I45=\"NO\"),\"OK\",\"JUSTIFICAR\"))","v":"JUSTIFICAR"}]
[{"$f":"+Acciones!C46","v":"Elaboración de un código de ética y suscripción por parte del personal del OO"},null,{"$f":"+IF(AND(B54=\"si\",Acciones!I46=\"SI\"),\"OK\",IF(AND(B54=\"NO\",Acciones!I46=\"NO\"),\"OK\",\"JUSTIFICAR\"))","v":"JUSTIFICAR"}]
[{"$f":"+Acciones!C47","v":"Sistema informático de contabilidad"},null,{"$f":"+IF(AND(B55=\"si\",Acciones!I47=\"SI\"),\"OK\",IF(AND(B55=\"NO\",Acciones!I47=\"NO\"),\"OK\",\"JUSTIFICAR\"))","v":"JUSTIFICAR"}]
[{"$f":"+Acciones!C48","v":"Sistema de planeación Integral"},null,{"$f":"+IF(AND(B56=\"si\",Acciones!I48=\"SI\"),\"OK\",IF(AND(B56=\"NO\",Acciones!I48=\"NO\"),\"OK\",\"JUSTIFICAR\"))","v":"JUSTIFICAR"}]
[{"$f":"+Acciones!C49","v":"Asesoría para financiamiento de contraparte"},null,{"$f":"+IF(AND(B57=\"si\",Acciones!I49=\"SI\"),\"OK\",IF(AND(B57=\"NO\",Acciones!I49=\"NO\"),\"OK\",\"JUSTIFICAR\"))","v":"JUSTIFICAR"}]
["Total PAI para sostenibilidad a las acciones"]

{"sheet":"Premisas Beneficios","index":27,"n_rows":58,"n_cols":6,"rows_kept":58,"cut":false,"hidden":true,"merged":[[3,1,3,4],[4,1,4,4]]}
[]
["Formato Evaluación 3. BENEFICIOS DE LAS ACCIONES A CONSIDERAR EN EL PDI"]
[]
["NOMBRE:",{"$f":"+'Acciones a Ejecutar'!B4:D4","v":"X"}]
["AÑO:",{"$f":"+'Acciones a Ejecutar'!B5:D5","v":0}]
[]
["1. PAI para reducir gastos de energía eléctrica","Variable de ahorro 1","% Ahorro 1","Variable de ahorro 2","% Ahorro 2","Datos Válidos"]
[{"$f":"+Acciones!C8","v":"Solicitud de cambio de tarifa eléctrica para reducir gasto por concepto de energía eléctrica."},"Total Energía Eléctrica",null,null,null,{"$f":"+\"Entre \" & TEXT('Parametros Evaluacion'!$C$9,\"##0.00%\") & \" y \" & TEXT('Parametros Evaluacion'!$D$9,\"##0.00%\")","v":"Entre 0.00% y 0.00%"}]
[{"$f":"+Acciones!C9","v":"Reducción de la potencia reactiva (reducción del factor de potencia)"},"Total Energía Eléctrica",null,null,null,{"$f":"+\"Entre \" & TEXT('Parametros Evaluacion'!$C$9,\"##0.00%\") & \" y \" & TEXT('Parametros Evaluacion'!$D$9,\"##0.00%\")","v":"Entre 0.00% y 0.00%"}]
[{"$f":"+Acciones!C10","v":"Sustitución de equipos de bombeo de agua potable para reducir consumo de energía"},"Total Energía Eléctrica",null,null,null,{"$f":"+\"Entre \" & TEXT('Parametros Evaluacion'!$C$9,\"##0.00%\") & \" y \" & TEXT('Parametros Evaluacion'!$D$9,\"##0.00%\")","v":"Entre 0.00% y 0.00%"}]
[{"$f":"+Acciones!C11","v":"Sustitución o construcción de tanques de almacenamiento de agua para modificar políticas de operación del equipo de bombeo"},"Total Energía Eléctrica",null,"Aumento de ventas por tanques (m3/toma)",null,{"$f":"+\"Entre \" & TEXT('Parametros Evaluacion'!$C$9,\"##0.00%\") & \" y \" & TEXT('Parametros Evaluacion'!$D$9,\"##0.00%\") & \"  -  \" & \"Entre \" & TEXT('Parametros Evaluacion'!$C$10,\"##0.00%\") & \" y \" & TEXT('Parametros Evaluacion'!$D$10,\"##0.00%\")","v":"Entre 0.00% y 0.00%  -  Entre 0.00% y 0.00%"}]
[{"$f":"+Acciones!C12","v":"Automatización de equipos de bombeo para modificar políticas de operación"},"Total Energía Eléctrica",null,"Disminución de costo de personal (%)",null,{"$f":"+\"Entre \" & TEXT('Parametros Evaluacion'!$C$9,\"##0.00%\") & \" y \" & TEXT('Parametros Evaluacion'!$D$9,\"##0.00%\") & \"  -  \" & \"Entre \" & TEXT('Parametros Evaluacion'!$C$11,\"##0.00%\") & \" y \" & TEXT('Parametros Evaluacion'!$D$11,\"##0.00%\")","v":"Entre 0.00% y 0.00%  -  Entre 0.00% y 0.00%"}]
[{"$f":"+Acciones!C13","v":"Sustitución de bombas de alcantarillado"},"Total Energía Eléctrica",null,null,null,{"$f":"+\"Entre \" & TEXT('Parametros Evaluacion'!$C$9,\"##0.00%\") & \" y \" & TEXT('Parametros Evaluacion'!$D$9,\"##0.00%\")","v":"Entre 0.00% y 0.00%"}]
[{"$f":"+Acciones!C14","v":"Reducción de gastos de energía en plantas de tratamiento de aguas residuales (PTAR)"},"Total Energía Eléctrica",null,null,null,{"$f":"+\"Entre \" & TEXT('Parametros Evaluacion'!$C$9,\"##0.00%\") & \" y \" & TEXT('Parametros Evaluacion'!$D$9,\"##0.00%\")","v":"Entre 0.00% y 0.00%"}]
[{"$f":"+Acciones!C15","v":"Elaboración de una auditoría energética"},null,null,null,null,{"$f":"+\"Entre \" & TEXT('Parametros Evaluacion'!$C$9,\"##0.00%\") & \" y \" & TEXT('Parametros Evaluacion'!$D$9,\"##0.00%\")","v":"Entre 0.00% y 0.00%"}]
["Total Inversión PAI para reducción de gastos de energía eléctrica"]
["2. PAI para incrementar la productividad del personal "]
[{"$f":"+Acciones!C16","v":"Programa de capacitación y profesionalización para incrementar la productividad del personal."},"Reducción de personal por capacitación",null,null,null,{"$f":"+\"Entre \" & TEXT('Parametros Evaluacion'!$C13,\"##0.00\") & \" y \" & TEXT('Parametros Evaluacion'!$D13,\"##0.00\")","v":"Entre 0.00 y 0.00"}]
[{"$f":"+Acciones!C17","v":"Revisión del manual de funciones y cargos del personal del OO"},"Reducción de personal por manuales",null,null,null,{"$f":"+\"Entre \" & TEXT('Parametros Evaluacion'!$C14,\"##0.00\") & \" y \" & TEXT('Parametros Evaluacion'!$D14,\"##0.00\")","v":"Entre 0.00 y 0.00"}]
[{"$f":"+Acciones!C18","v":"Establecimiento de un programa de retiro voluntario y obligado"},"Reducción de personal por retiro",null,null,null,{"$f":"+\"Entre \" & TEXT('Parametros Evaluacion'!$C15,\"##0.00\") & \" y \" & TEXT('Parametros Evaluacion'!$D15,\"##0.00\")","v":"Entre 0.00 y 0.00"}]
["Total Inversión PAI para incrementar la productividad del personal"]
["3. PAI para mejora de la Gestión Comercial"]
[{"$f":"+Acciones!C19","v":"Ajuste de consumos de cuota fija"},"Incremento Tarifa Cuota Fija",null,null,null,{"$f":"+\"Entre \" & TEXT('Parametros Evaluacion'!$C17,\"##0.00%\") & \" y \" & TEXT('Parametros Evaluacion'!$D17,\"##0.00%\")","v":"Entre 0.00% y 0.00%"}]
[{"$f":"+Acciones!C20","v":"Corrección de errores de micromedición mediante sustitución de medidores."},"Incremento de facturación por cambio de medidores",null,null,null,{"$f":"+\"Entre \" & TEXT('Parametros Evaluacion'!$C18,\"##0.00%\") & \" y \" & TEXT('Parametros Evaluacion'!$D18,\"##0.00%\")","v":"Entre 0.00% y 0.00%"}]
[{"$f":"+Acciones!C21","v":"Impartición de cursos de formación de recursos humanos en eficiencia comercial"},"Mejora de eficiencia comercial por capacitación",null,null,null,{"$f":"+\"Entre \" & TEXT('Parametros Evaluacion'!$C19,\"##0.00%\") & \" y \" & TEXT('Parametros Evaluacion'!$D19,\"##0.00%\")","v":"Entre 0.00% y 0.00%"}]
[{"$f":"+Acciones!C22","v":"Impartición de cursos de formación de recursos humanos en atención a usuarios"},"Mejora de eficiencia comercial por capacitación",{"$f":"+C25","v":0}]
[{"$f":"+Acciones!C23","v":"Firma de convenios con bancos y otras instituciones para ampliar las opciones de pago de los servicios de agua y saneamiento"},"Mejora de eficiencia comercial por red de cobro",null,null,null,{"$f":"+\"Entre \" & TEXT('Parametros Evaluacion'!$C20,\"##0.00%\") & \" y \" & TEXT('Parametros Evaluacion'!$D20,\"##0.00%\")","v":"Entre 0.00% y 0.00%"}]
[{"$f":"+Acciones!C24","v":"Mejoras a la facturación mediante un nuevo sistema comercial"},"Mejora de eficiencia comercial por nuevo sistema",null,null,null,{"$f":"+\"Entre \" & TEXT('Parametros Evaluacion'!$C21,\"##0.00%\") & \" y \" & TEXT('Parametros Evaluacion'!$D21,\"##0.00%\")","v":"Entre 0.00% y 0.00%"}]
[{"$f":"+Acciones!C25","v":"Mejoras en la cobranza mediante esquemas que faciliten el pago."},"Mejora de eficiencia comercial por facilidad de pago",null,null,null,{"$f":"+\"Entre \" & TEXT('Parametros Evaluacion'!$C22,\"##0.00%\") & \" y \" & TEXT('Parametros Evaluacion'!$D22,\"##0.00%\")","v":"Entre 0.00% y 0.00%"}]
[{"$f":"+Acciones!C26","v":"Localización y regularización de tomas clandestinas"},"Aumento de facturación por clandestinos",null,null,null,{"$f":"+\"Entre \" & TEXT('Parametros Evaluacion'!$C23,\"##0.00%\") & \" y \" & TEXT('Parametros Evaluacion'!$D23,\"##0.00%\")","v":"Entre 0.00% y 0.00%"}]
[{"$f":"+Acciones!C27","v":"Censo de usuarios para mejorar el padrón. Establecimiento de esquemas de actualización continua del padrón."},"Aumento de usuarios por censo",null,"Aumento de facturación por cambio de uso",null,{"$f":"+\"Entre \" & TEXT('Parametros Evaluacion'!$C24,\"##0.00%\") & \" y \" & TEXT('Parametros Evaluacion'!$D24,\"##0.00%\") & \"  -  \" & \"Entre \" & TEXT('Parametros Evaluacion'!$C26,\"##0.00%\") & \" y \" & TEXT('Parametros Evaluacion'!$D26,\"##0.00%\")","v":"Entre 0.00% y 0.00%  -  Entre 0.00% y 0.00%"}]
[{"$f":"+Acciones!C28","v":"Sistema de cómputo para altas y bajas del padrón de usuarios."},"Aumento de usuarios por sistema",null,null,null,{"$f":"+\"Entre \" & TEXT('Parametros Evaluacion'!$C25,\"##0.00%\") & \" y \" & TEXT('Parametros Evaluacion'!$D25,\"##0.00%\")","v":"Entre 0.00% y 0.00%"}]
[{"$f":"+Acciones!C29","v":"Estudio tarifario con el fin de realizar la actualización de las tarifas de agua"},"Aumento de tarifas medias por nuevas tarifas",null,null,null,{"$f":"+\"Entre \" & TEXT('Parametros Evaluacion'!$C27,\"##0.00%\") & \" y \" & TEXT('Parametros Evaluacion'!$D27,\"##0.00%\")","v":"Entre 0.00% y 0.00%"}]
[{"$f":"+Acciones!C30","v":"Modificaciones a la estructura tarifaria"},"Aumento de tarifas medias por estructura de tarifas",null,null,null,{"$f":"+\"Entre \" & TEXT('Parametros Evaluacion'!$C28,\"##0.00%\") & \" y \" & TEXT('Parametros Evaluacion'!$D28,\"##0.00%\")","v":"Entre 0.00% y 0.00%"}]
[{"$f":"+Acciones!C31","v":"Reformas para lograr que las tarifas se actualicen de manera continua"}]
[{"$f":"+Acciones!C32","v":"Reformas al marco legal para que el OO pueda establecer tarifas adecuadas"}]
["Total PAI para mejora de la Gestión Comercial"]
["4. PAI para reducción de Pérdidas Físicas de Agua"]
[{"$f":"+Acciones!C33","v":"Localización y reparación de fugas en tanques"},"Mejora E.F. por tanques",null,null,null,{"$f":"+\"Entre \" & TEXT('Parametros Evaluacion'!$C29,\"##0.00%\") & \" y \" & TEXT('Parametros Evaluacion'!$D29,\"##0.00%\")","v":"Entre 0.00% y 0.00%"}]
[{"$f":"+Acciones!C34","v":"Localización y reparación de fugas en tuberías principales y secundarias"},"Mejora E.F. en tuberías",null,null,null,{"$f":"+\"Entre \" & TEXT('Parametros Evaluacion'!$C30,\"##0.00%\") & \" y \" & TEXT('Parametros Evaluacion'!$D30,\"##0.00%\")","v":"Entre 0.00% y 0.00%"}]
[{"$f":"+Acciones!C35","v":"Instalación de micromedidores en las tomas"},"Mejora E.F. en tomas",null,null,null,{"$f":"+\"Entre \" & TEXT('Parametros Evaluacion'!$C31,\"##0.00%\") & \" y \" & TEXT('Parametros Evaluacion'!$D31,\"##0.00%\")","v":"Entre 0.00% y 0.00%"}]
[{"$f":"+Acciones!C36","v":"Sistematización de lectura de micromedidores en tomas e incorporación de lecturas al sistema de facturación y cobranza"},"Aumento de ingresos por tomas de lectura",null,null,null,{"$f":"+\"Entre \" & TEXT('Parametros Evaluacion'!$C32,\"##0.00%\") & \" y \" & TEXT('Parametros Evaluacion'!$D32,\"##0.00%\")","v":"Entre 0.00% y 0.00%"}]
[{"$f":"+Acciones!C37","v":"Optimización hidráulica: sectorización de la red de distribución, control de presión, optimización de la capacidad de almacenamiento."},"Mejora E.F. por sectorización",null,null,null,{"$f":"+\"Entre \" & TEXT('Parametros Evaluacion'!$C33,\"##0.00%\") & \" y \" & TEXT('Parametros Evaluacion'!$D33,\"##0.00%\")","v":"Entre 0.00% y 0.00%"}]
[{"$f":"+Acciones!C38","v":"Catastro de infraestructura hidráulica y de redes"},"Mejora E.F. por catastro de redes",null,null,null,{"$f":"+\"Entre \" & TEXT('Parametros Evaluacion'!$C34,\"##0.00%\") & \" y \" & TEXT('Parametros Evaluacion'!$D34,\"##0.00%\")","v":"Entre 0.00% y 0.00%"}]
[{"$f":"+Acciones!C39","v":"Instalación de macromedidores en captaciones"},"Mejora E.F. por macromedición en captaciones",null,null,null,{"$f":"+\"Entre \" & TEXT('Parametros Evaluacion'!$C35,\"##0.00%\") & \" y \" & TEXT('Parametros Evaluacion'!$D35,\"##0.00%\")","v":"Entre 0.00% y 0.00%"}]
[{"$f":"+Acciones!C40","v":"Instalación de macromedidores en sectores"},"Mejora E.F. por macromedición en sectores",null,null,null,{"$f":"+\"Entre \" & TEXT('Parametros Evaluacion'!$C36,\"##0.00%\") & \" y \" & TEXT('Parametros Evaluacion'!$D36,\"##0.00%\")","v":"Entre 0.00% y 0.00%"}]
[{"$f":"+Acciones!C41","v":"Sistematización de lectura de macromedidores en captaciones y sectores ( p.ej. a través de telemetría)"},"Mejora E.F. por lectura de macros",null,null,null,{"$f":"+\"Entre \" & TEXT('Parametros Evaluacion'!$C37,\"##0.00%\") & \" y \" & TEXT('Parametros Evaluacion'!$D37,\"##0.00%\")","v":"Entre 0.00% y 0.00%"}]
[{"$f":"+Acciones!C42","v":"Sustitución de tuberías con alto índice de fugas"},"Mejora E.F. por sustitución de tuberías",null,null,null,{"$f":"+\"Entre \" & TEXT('Parametros Evaluacion'!$C38,\"##0.00%\") & \" y \" & TEXT('Parametros Evaluacion'!$D38,\"##0.00%\")","v":"Entre 0.00% y 0.00%"}]
[{"$f":"+Acciones!C43","v":"Capacitación del personal del OO en operación de equipos"},"Mejora E.F. por mayor capacitación",null,null,null,{"$f":"+\"Entre \" & TEXT('Parametros Evaluacion'!$C39,\"##0.00%\") & \" y \" & TEXT('Parametros Evaluacion'!$D39,\"##0.00%\")","v":"Entre 0.00% y 0.00%"}]
[{"$f":"+Acciones!C44","v":"Sistema de Información Geográfica"},"Mejora E.F. por GIS",null,null,null,{"$f":"+\"Entre \" & TEXT('Parametros Evaluacion'!$C40,\"##0.00%\") & \" y \" & TEXT('Parametros Evaluacion'!$D40,\"##0.00%\")","v":"Entre 0.00% y 0.00%"}]
["Total PAI para reducción de Pérdidas Físicas de Agua"]
["5. PAI para sostenibilidad a las acciones "]
[{"$f":"+Acciones!C45","v":"Establecimiento de un comité ciudadano del organismo operador"}]
[{"$f":"+Acciones!C46","v":"Elaboración de un código de ética y suscripción por parte del personal del OO"}]
[{"$f":"+Acciones!C47","v":"Sistema informático de contabilidad"}]
[{"$f":"+Acciones!C48","v":"Sistema de planeación Integral"}]
[{"$f":"+Acciones!C49","v":"Asesoría para financiamiento de contraparte"}]
["Total PAI para sostenibilidad a las acciones"]

{"sheet":"Premisas Inversiones","index":28,"n_rows":58,"n_cols":4,"rows_kept":58,"cut":false,"hidden":true,"merged":[[3,1,3,4],[4,1,4,4]]}
[]
["Formato Evaluación 4. INVERSIONES DE LAS ACCIONES A CONSIDERAR EN EL PDI"]
[]
["NOMBRE:",{"$f":"+'Acciones a Ejecutar'!B4:D4","v":"X"}]
["AÑO:",{"$f":"+'Acciones a Ejecutar'!B5:D5","v":0}]
[]
["1. PAI para reducir gastos de energía eléctrica","Inversión 1","Costo 1 ($)","Datos Válidos"]
[{"$f":"+Acciones!C8","v":"Solicitud de cambio de tarifa eléctrica para reducir gasto por concepto de energía eléctrica."},"Asesoría Cambio de tarifas Eléctrica",null,{"$f":"+\"Entre \" & TEXT('Parametros Evaluacion'!C42,\"#,##0\") & \" y \" & TEXT('Parametros Evaluacion'!D42,\"#,##0\")","v":"Entre 0 y 0"}]
[{"$f":"+Acciones!C9","v":"Reducción de la potencia reactiva (reducción del factor de potencia)"},"Instalación o sustitución de equipos",null,{"$f":"+\"Entre \" & TEXT('Parametros Evaluacion'!C43,\"#,##0\") & \" y \" & TEXT('Parametros Evaluacion'!D43,\"#,##0\")","v":"Entre 0 y 0"}]
[{"$f":"+Acciones!C10","v":"Sustitución de equipos de bombeo de agua potable para reducir consumo de energía"},"Compra e instalación de bombas AP",null,{"$f":"+\"Entre \" & TEXT('Parametros Evaluacion'!C44,\"#,##0\") & \" y \" & TEXT('Parametros Evaluacion'!D44,\"#,##0\")","v":"Entre 0 y 0"}]
[{"$f":"+Acciones!C11","v":"Sustitución o construcción de tanques de almacenamiento de agua para modificar políticas de operación del equipo de bombeo"},"Construcción de tanques",null,{"$f":"+\"Entre \" & TEXT('Parametros Evaluacion'!C45,\"#,##0\") & \" y \" & TEXT('Parametros Evaluacion'!D45,\"#,##0\")","v":"Entre 0 y 0"}]
[{"$f":"+Acciones!C12","v":"Automatización de equipos de bombeo para modificar políticas de operación"},"Automatización Bombas",null,{"$f":"+\"Entre \" & TEXT('Parametros Evaluacion'!C46,\"#,##0\") & \" y \" & TEXT('Parametros Evaluacion'!D46,\"#,##0\")","v":"Entre 0 y 0"}]
[{"$f":"+Acciones!C13","v":"Sustitución de bombas de alcantarillado"},"Compra e instalación de bombas A.R.",null,{"$f":"+\"Entre \" & TEXT('Parametros Evaluacion'!C47,\"#,##0\") & \" y \" & TEXT('Parametros Evaluacion'!D47,\"#,##0\")","v":"Entre 0 y 0"}]
[{"$f":"+Acciones!C14","v":"Reducción de gastos de energía en plantas de tratamiento de aguas residuales (PTAR)"},"Cambio de equipos PTAR",null,{"$f":"+\"Entre \" & TEXT('Parametros Evaluacion'!C48,\"#,##0\") & \" y \" & TEXT('Parametros Evaluacion'!D48,\"#,##0\")","v":"Entre 0 y 0"}]
[{"$f":"+Acciones!C15","v":"Elaboración de una auditoría energética"},"Estudio Eficiencia Energética",null,{"$f":"+\"Entre \" & TEXT('Parametros Evaluacion'!C49,\"#,##0\") & \" y \" & TEXT('Parametros Evaluacion'!D49,\"#,##0\")","v":"Entre 0 y 0"}]
["Total Inversión PAI para reducción de gastos de energía eléctrica"]
["2. PAI para incrementar la productividad del personal "]
[{"$f":"+Acciones!C16","v":"Programa de capacitación y profesionalización para incrementar la productividad del personal."},"Cursos de capacitación",null,{"$f":"+\"Entre \" & TEXT('Parametros Evaluacion'!C50,\"#,##0\") & \" y \" & TEXT('Parametros Evaluacion'!D50,\"#,##0\")","v":"Entre 0 y 0"}]
[{"$f":"+Acciones!C17","v":"Revisión del manual de funciones y cargos del personal del OO"},"Costo Manuales y retiro por optimización",null,{"$f":"+\"Entre \" & TEXT('Parametros Evaluacion'!C51+'Parametros Evaluacion'!C52,\"#,##0\") & \" y \" & TEXT('Parametros Evaluacion'!D51+'Parametros Evaluacion'!D52,\"#,##0\")","v":"Entre 0 y 0"}]
[{"$f":"+Acciones!C18","v":"Establecimiento de un programa de retiro voluntario y obligado"},"Reducción de personal por retiro",null,{"$f":"+\"Entre \" & TEXT('Parametros Evaluacion'!C53,\"#,##0\") & \" y \" & TEXT('Parametros Evaluacion'!D53,\"#,##0\")","v":"Entre 0 y 0"}]
["Total Inversión PAI para incrementar la productividad del personal"]
["3. PAI para mejora de la Gestión Comercial"]
[{"$f":"+Acciones!C19","v":"Ajuste de consumos de cuota fija"},"Estudio Consumo Cuota Fija",null,{"$f":"+\"Entre \" & TEXT('Parametros Evaluacion'!C54,\"#,##0\") & \" y \" & TEXT('Parametros Evaluacion'!D54,\"#,##0\")","v":"Entre 0 y 0"}]
[{"$f":"+Acciones!C20","v":"Corrección de errores de micromedición mediante sustitución de medidores."},"Adquisición y sustitución de medidores",{"$f":"+'Acciones a Ejecutar'!D24*'Parametros Evaluacion'!D55","v":0}]
[{"$f":"+Acciones!C21","v":"Impartición de cursos de formación de recursos humanos en eficiencia comercial"},"Capacitación Ef. Comercial",null,{"$f":"+\"Entre \" & TEXT('Parametros Evaluacion'!C56,\"#,##0\") & \" y \" & TEXT('Parametros Evaluacion'!D56,\"#,##0\")","v":"Entre 0 y 0"}]
[{"$f":"+Acciones!C22","v":"Impartición de cursos de formación de recursos humanos en atención a usuarios"},"Capacitación Atención de usuarios",null,{"$f":"+\"Entre \" & TEXT('Parametros Evaluacion'!C57,\"#,##0\") & \" y \" & TEXT('Parametros Evaluacion'!D57,\"#,##0\")","v":"Entre 0 y 0"}]
[{"$f":"+Acciones!C23","v":"Firma de convenios con bancos y otras instituciones para ampliar las opciones de pago de los servicios de agua y saneamiento"},"Asesoría convenios recaudadores",null,{"$f":"+\"Entre \" & TEXT('Parametros Evaluacion'!C58,\"#,##0\") & \" y \" & TEXT('Parametros Evaluacion'!D58,\"#,##0\")","v":"Entre 0 y 0"}]
[{"$f":"+Acciones!C24","v":"Mejoras a la facturación mediante un nuevo sistema comercial"},"Implementación sistema comercial",null,{"$f":"+\"Entre \" & TEXT('Parametros Evaluacion'!C59,\"#,##0\") & \" y \" & TEXT('Parametros Evaluacion'!D59,\"#,##0\")","v":"Entre 0 y 0"}]
[{"$f":"+Acciones!C25","v":"Mejoras en la cobranza mediante esquemas que faciliten el pago."},"Asesoría en esquema de cobranza",null,{"$f":"+\"Entre \" & TEXT('Parametros Evaluacion'!C60,\"#,##0\") & \" y \" & TEXT('Parametros Evaluacion'!D60,\"#,##0\")","v":"Entre 0 y 0"}]
[{"$f":"+Acciones!C26","v":"Localización y regularización de tomas clandestinas"},"Campaña de búsqueda de clandestinos",null,{"$f":"+\"Entre \" & TEXT('Parametros Evaluacion'!C61,\"#,##0\") & \" y \" & TEXT('Parametros Evaluacion'!D61,\"#,##0\")","v":"Entre 0 y 0"}]
[{"$f":"+Acciones!C27","v":"Censo de usuarios para mejorar el padrón. Establecimiento de esquemas de actualización continua del padrón."},"Censo de usuarios",null,{"$f":"+\"Entre \" & TEXT('Parametros Evaluacion'!C62,\"#,##0\") & \" y \" & TEXT('Parametros Evaluacion'!D62,\"#,##0\")","v":"Entre 0 y 0"}]
[{"$f":"+Acciones!C28","v":"Sistema de cómputo para altas y bajas del padrón de usuarios."},"Sistema informático de factibilidades",null,{"$f":"+\"Entre \" & TEXT('Parametros Evaluacion'!C63,\"#,##0\") & \" y \" & TEXT('Parametros Evaluacion'!D63,\"#,##0\")","v":"Entre 0 y 0"}]
[{"$f":"+Acciones!C29","v":"Estudio tarifario con el fin de realizar la actualización de las tarifas de agua"},"Estudio Tarifario",null,{"$f":"+\"Entre \" & TEXT('Parametros Evaluacion'!C64,\"#,##0\") & \" y \" & TEXT('Parametros Evaluacion'!D64,\"#,##0\")","v":"Entre 0 y 0"}]
[{"$f":"+Acciones!C30","v":"Modificaciones a la estructura tarifaria"},"Estudio estructura tarifaria",null,{"$f":"+\"Entre \" & TEXT('Parametros Evaluacion'!C65,\"#,##0\") & \" y \" & TEXT('Parametros Evaluacion'!D65,\"#,##0\")","v":"Entre 0 y 0"}]
[{"$f":"+Acciones!C31","v":"Reformas para lograr que las tarifas se actualicen de manera continua"},"Estudio para polinomio tarifas y reformas legales",null,{"$f":"+\"Entre \" & TEXT('Parametros Evaluacion'!C66,\"#,##0\") & \" y \" & TEXT('Parametros Evaluacion'!D66,\"#,##0\")","v":"Entre 0 y 0"}]
[{"$f":"+Acciones!C32","v":"Reformas al marco legal para que el OO pueda establecer tarifas adecuadas"},"Estudio de reformas a la Ley por tarifas",null,{"$f":"+\"Entre \" & TEXT('Parametros Evaluacion'!C67,\"#,##0\") & \" y \" & TEXT('Parametros Evaluacion'!D67,\"#,##0\")","v":"Entre 0 y 0"}]
["Total PAI para mejora de la Gestión Comercial"]
["4. PAI para reducción de Pérdidas Físicas de Agua"]
[{"$f":"+Acciones!C33","v":"Localización y reparación de fugas en tanques"},"Costo Total fugas tanque",null,{"$f":"+\"Entre \" & TEXT('Parametros Evaluacion'!C68,\"#,##0\") & \" y \" & TEXT('Parametros Evaluacion'!D68,\"#,##0\")","v":"Entre 0 y 0"}]
[{"$f":"+Acciones!C34","v":"Localización y reparación de fugas en tuberías principales y secundarias"},"Costo localización y reparación fugas",null,{"$f":"+\"Entre \" & TEXT('Parametros Evaluacion'!C69,\"#,##0\") & \" y \" & TEXT('Parametros Evaluacion'!D69,\"#,##0\")","v":"Entre 0 y 0"}]
[{"$f":"+Acciones!C35","v":"Instalación de micromedidores en las tomas"},"Instalación nuevos micromedidores",{"$f":"+'Acciones a Ejecutar'!D41*'Parametros Evaluacion'!D70","v":0}]
[{"$f":"+Acciones!C36","v":"Sistematización de lectura de micromedidores en tomas e incorporación de lecturas al sistema de facturación y cobranza"},"Sistema de lectura automático micro",null,{"$f":"+\"Entre \" & TEXT('Parametros Evaluacion'!C71,\"#,##0\") & \" y \" & TEXT('Parametros Evaluacion'!D71,\"#,##0\")","v":"Entre 0 y 0"}]
[{"$f":"+Acciones!C37","v":"Optimización hidráulica: sectorización de la red de distribución, control de presión, optimización de la capacidad de almacenamiento."},"Sectorización",null,{"$f":"+\"Entre \" & TEXT('Parametros Evaluacion'!C72,\"#,##0\") & \" y \" & TEXT('Parametros Evaluacion'!D72,\"#,##0\")","v":"Entre 0 y 0"}]
[{"$f":"+Acciones!C38","v":"Catastro de infraestructura hidráulica y de redes"},"Catastro de redes",null,{"$f":"+\"Entre \" & TEXT('Parametros Evaluacion'!C73,\"#,##0\") & \" y \" & TEXT('Parametros Evaluacion'!D73,\"#,##0\")","v":"Entre 0 y 0"}]
[{"$f":"+Acciones!C39","v":"Instalación de macromedidores en captaciones"},"Macromedición en captaciones",null,{"$f":"+\"Entre \" & TEXT('Parametros Evaluacion'!C74,\"#,##0\") & \" y \" & TEXT('Parametros Evaluacion'!D74,\"#,##0\")","v":"Entre 0 y 0"}]
[{"$f":"+Acciones!C40","v":"Instalación de macromedidores en sectores"},"Macromedición en sectores",null,{"$f":"+\"Entre \" & TEXT('Parametros Evaluacion'!C75,\"#,##0\") & \" y \" & TEXT('Parametros Evaluacion'!D75,\"#,##0\")","v":"Entre 0 y 0"}]
[{"$f":"+Acciones!C41","v":"Sistematización de lectura de macromedidores en captaciones y sectores ( p.ej. a través de telemetría)"},"Automatización lectura macromedidores",null,{"$f":"+\"Entre \" & TEXT('Parametros Evaluacion'!C76,\"#,##0\") & \" y \" & TEXT('Parametros Evaluacion'!D76,\"#,##0\")","v":"Entre 0 y 0"}]
[{"$f":"+Acciones!C42","v":"Sustitución de tuberías con alto índice de fugas"},"Sustitución tuberías por fugas",null,{"$f":"+\"Entre \" & TEXT('Parametros Evaluacion'!C77,\"#,##0\") & \" y \" & TEXT('Parametros Evaluacion'!D77,\"#,##0\")","v":"Entre 0 y 0"}]
[{"$f":"+Acciones!C43","v":"Capacitación del personal del OO en operación de equipos"},"Capacitación en operaciones",null,{"$f":"+\"Entre \" & TEXT('Parametros Evaluacion'!C78,\"#,##0\") & \" y \" & TEXT('Parametros Evaluacion'!D78,\"#,##0\")","v":"Entre 0 y 0"}]
[{"$f":"+Acciones!C44","v":"Sistema de Información Geográfica"},"GIS",null,{"$f":"+\"Entre \" & TEXT('Parametros Evaluacion'!C79,\"#,##0\") & \" y \" & TEXT('Parametros Evaluacion'!D79,\"#,##0\")","v":"Entre 0 y 0"}]
["Total PAI para reducción de Pérdidas Físicas de Agua"]
["5. PAI para sostenibilidad a las acciones "]
[{"$f":"+Acciones!C45","v":"Establecimiento de un comité ciudadano del organismo operador"},"Estudio Consejo ciudadanizado",null,{"$f":"+\"Entre \" & TEXT('Parametros Evaluacion'!C82,\"#,##0\") & \" y \" & TEXT('Parametros Evaluacion'!D82,\"#,##0\")","v":"Entre 0 y 0"}]
[{"$f":"+Acciones!C46","v":"Elaboración de un código de ética y suscripción por parte del personal del OO"},"Estudio Código de ética",null,{"$f":"+\"Entre \" & TEXT('Parametros Evaluacion'!C83,\"#,##0\") & \" y \" & TEXT('Parametros Evaluacion'!D83,\"#,##0\")","v":"Entre 0 y 0"}]
[{"$f":"+Acciones!C47","v":"Sistema informático de contabilidad"},"Sistema Contable",null,{"$f":"+\"Entre \" & TEXT('Parametros Evaluacion'!C84,\"#,##0\") & \" y \" & TEXT('Parametros Evaluacion'!D84,\"#,##0\")","v":"Entre 0 y 0"}]
[{"$f":"+Acciones!C48","v":"Sistema de planeación Integral"},"Asesoría sistema planeación",null,{"$f":"+\"Entre \" & TEXT('Parametros Evaluacion'!C85,\"#,##0\") & \" y \" & TEXT('Parametros Evaluacion'!D85,\"#,##0\")","v":"Entre 0 y 0"}]
[{"$f":"+Acciones!C49","v":"Asesoría para financiamiento de contraparte"},"Financiamiento contraparte",null,{"$f":"+\"Entre \" & TEXT('Parametros Evaluacion'!C86,\"#,##0\") & \" y \" & TEXT('Parametros Evaluacion'!D86,\"#,##0\")","v":"Entre 0 y 0"}]
["Total PAI para sostenibilidad a las acciones"]

{"sheet":"Premisas OPEX","index":29,"n_rows":58,"n_cols":4,"rows_kept":58,"cut":false,"hidden":true,"merged":[[4,1,4,4]]}
[]
["Formato Evaluación 5. GASTOS OPERACIONALES ADICIONALES DE LAS ACCIONES A CONSIDERAR EN EL PDI"]
[]
["NOMBRE:",{"$f":"+'Acciones a Ejecutar'!B4:D4","v":"X"}]
["AÑO:",{"$f":"+'Acciones a Ejecutar'!B5:D5","v":0}]
[]
["1. PAI para reducir gastos de energía eléctrica","Concepto Costo 1","Costo 1 ($)","Datos Válidos"]
[{"$f":"+Acciones!C8","v":"Solicitud de cambio de tarifa eléctrica para reducir gasto por concepto de energía eléctrica."}]
[{"$f":"+Acciones!C9","v":"Reducción de la potencia reactiva (reducción del factor de potencia)"}]
[{"$f":"+Acciones!C10","v":"Sustitución de equipos de bombeo de agua potable para reducir consumo de energía"}]
[{"$f":"+Acciones!C11","v":"Sustitución o construcción de tanques de almacenamiento de agua para modificar políticas de operación del equipo de bombeo"}]
[{"$f":"+Acciones!C12","v":"Automatización de equipos de bombeo para modificar políticas de operación"}]
[{"$f":"+Acciones!C13","v":"Sustitución de bombas de alcantarillado"}]
[{"$f":"+Acciones!C14","v":"Reducción de gastos de energía en plantas de tratamiento de aguas residuales (PTAR)"}]
[{"$f":"+Acciones!C15","v":"Elaboración de una auditoría energética"}]
["Total Inversión PAI para reducción de gastos de energía eléctrica"]
["2. PAI para incrementar la productividad del personal "]
[{"$f":"+Acciones!C16","v":"Programa de capacitación y profesionalización para incrementar la productividad del personal."}]
[{"$f":"+Acciones!C17","v":"Revisión del manual de funciones y cargos del personal del OO"}]
[{"$f":"+Acciones!C18","v":"Establecimiento de un programa de retiro voluntario y obligado"}]
["Total Inversión PAI para incrementar la productividad del personal"]
["3. PAI para mejora de la Gestión Comercial"]
[{"$f":"+Acciones!C19","v":"Ajuste de consumos de cuota fija"}]
[{"$f":"+Acciones!C20","v":"Corrección de errores de micromedición mediante sustitución de medidores."}]
[{"$f":"+Acciones!C21","v":"Impartición de cursos de formación de recursos humanos en eficiencia comercial"}]
[{"$f":"+Acciones!C22","v":"Impartición de cursos de formación de recursos humanos en atención a usuarios"}]
[{"$f":"+Acciones!C23","v":"Firma de convenios con bancos y otras instituciones para ampliar las opciones de pago de los servicios de agua y saneamiento"},"Costo anual cobranza externa",null,{"$f":"+\"Entre \" & TEXT('Parametros Evaluacion'!C87,\"###,###,##0\") & \" y \" & TEXT('Parametros Evaluacion'!D87,\"###,###,##0\")","v":"Entre 0 y 0"}]
[{"$f":"+Acciones!C24","v":"Mejoras a la facturación mediante un nuevo sistema comercial"},"Costo anual de mantenimiento y licenciamiento del SC",null,{"$f":"+\"Entre \" & TEXT('Parametros Evaluacion'!C88,\"###,###,##0\") & \" y \" & TEXT('Parametros Evaluacion'!D88,\"###,###,##0\")","v":"Entre 0 y 0"}]
[{"$f":"+Acciones!C25","v":"Mejoras en la cobranza mediante esquemas que faciliten el pago."},"Costo anual de esquema de cobranza",null,{"$f":"+\"Entre \" & TEXT('Parametros Evaluacion'!C89,\"###,###,##0\") & \" y \" & TEXT('Parametros Evaluacion'!D89,\"###,###,##0\")","v":"Entre 0 y 0"}]
[{"$f":"+Acciones!C26","v":"Localización y regularización de tomas clandestinas"}]
[{"$f":"+Acciones!C27","v":"Censo de usuarios para mejorar el padrón. Establecimiento de esquemas de actualización continua del padrón."},"Mantención del Censo de usuarios",null,{"$f":"+\"Entre \" & TEXT('Parametros Evaluacion'!C90,\"###,###,##0\") & \" y \" & TEXT('Parametros Evaluacion'!D90,\"###,###,##0\")","v":"Entre 0 y 0"}]
[{"$f":"+Acciones!C28","v":"Sistema de cómputo para altas y bajas del padrón de usuarios."}]
[{"$f":"+Acciones!C29","v":"Estudio tarifario con el fin de realizar la actualización de las tarifas de agua"}]
[{"$f":"+Acciones!C30","v":"Modificaciones a la estructura tarifaria"}]
[{"$f":"+Acciones!C31","v":"Reformas para lograr que las tarifas se actualicen de manera continua"}]
[{"$f":"+Acciones!C32","v":"Reformas al marco legal para que el OO pueda establecer tarifas adecuadas"}]
["Total PAI para mejora de la Gestión Comercial"]
["4. PAI para reducción de Pérdidas Físicas de Agua"]
[{"$f":"+Acciones!C33","v":"Localización y reparación de fugas en tanques"}]
[{"$f":"+Acciones!C34","v":"Localización y reparación de fugas en tuberías principales y secundarias"}]
[{"$f":"+Acciones!C35","v":"Instalación de micromedidores en las tomas"},"Lectura de nuevos medidores",null,{"$f":"+\"Entre \" & TEXT('Parametros Evaluacion'!C91,\"###,###,##0\") & \" y \" & TEXT('Parametros Evaluacion'!D91,\"###,###,##0\")","v":"Entre 0 y 0"}]
[{"$f":"+Acciones!C36","v":"Sistematización de lectura de micromedidores en tomas e incorporación de lecturas al sistema de facturación y cobranza"}]
[{"$f":"+Acciones!C37","v":"Optimización hidráulica: sectorización de la red de distribución, control de presión, optimización de la capacidad de almacenamiento."}]
[{"$f":"+Acciones!C38","v":"Catastro de infraestructura hidráulica y de redes"}]
[{"$f":"+Acciones!C39","v":"Instalación de macromedidores en captaciones"}]
[{"$f":"+Acciones!C40","v":"Instalación de macromedidores en sectores"}]
[{"$f":"+Acciones!C41","v":"Sistematización de lectura de macromedidores en captaciones y sectores ( p.ej. a través de telemetría)"}]
[{"$f":"+Acciones!C42","v":"Sustitución de tuberías con alto índice de fugas"}]
[{"$f":"+Acciones!C43","v":"Capacitación del personal del OO en operación de equipos"}]
[{"$f":"+Acciones!C44","v":"Sistema de Información Geográfica"}]
["Total PAI para reducción de Pérdidas Físicas de Agua"]
["5. PAI para sostenibilidad a las acciones "]
[{"$f":"+Acciones!C45","v":"Establecimiento de un comité ciudadano del organismo operador"}]
[{"$f":"+Acciones!C46","v":"Elaboración de un código de ética y suscripción por parte del personal del OO"}]
[{"$f":"+Acciones!C47","v":"Sistema informático de contabilidad"}]
[{"$f":"+Acciones!C48","v":"Sistema de planeación Integral"},"Costo adicional del área de planeación",null,{"$f":"+\"Entre \" & TEXT('Parametros Evaluacion'!C92,\"###,###,##0\") & \" y \" & TEXT('Parametros Evaluacion'!D92,\"###,###,##0\")","v":"Entre 0 y 0"}]
[{"$f":"+Acciones!C49","v":"Asesoría para financiamiento de contraparte"}]
["Total PAI para sostenibilidad a las acciones"]

{"sheet":"Detalle evaluacion","index":30,"n_rows":229,"n_cols":28,"rows_kept":229,"cut":false,"hidden":true,"merged":[[3,2,3,15],[4,2,4,15]]}
[]
[null,"Formato Evaluación 6. EVALUACION DE LOS PDI - FLUJOS LIBRES DE CAJA"]
[]
[null,"NOMBRE:",{"$f":"+'Acciones a Ejecutar'!B4","v":"X"}]
[null,"AÑO:",{"$f":"+'Acciones a Ejecutar'!B5","v":0}]
[]
[null,null,1,{"$f":"+C7+1","v":2},3,4,5,6,7,8,9,10,11,12,13,14,15,16,17,18,19,20]
[null,"Inversiones PAI  (Millones de pesos)",{"$f":"+Datos!C6+1","v":1},{"$f":"+C8+1","v":2},3,4,5,6,7,8,9,10,11,12,13,14,15,16,17,18,19,20]
[null,"1. PAI para reducir gastos de energía eléctrica"]
[null,{"$f":"+'Acciones a Ejecutar'!A8","v":"Solicitud de cambio de tarifa eléctrica para reducir gasto por concepto de energía eléctrica."},{"$f":"IF('Acciones a Ejecutar'!B8=\"si\",'Premisas Inversiones'!C8,0)/1000000","v":0},{"$f":"+IF(MOD(D$7,'Parametros Evaluacion'!$E42+1)=0,'Detalle evaluacion'!$C10,0)","v":0},{"$f":"+IF(MOD(E$7,'Parametros Evaluacion'!$E42+1)=0,'Detalle evaluacion'!$C10,0)","v":0},{"$f":"+IF(MOD(F$7,'Parametros Evaluacion'!$E42+1)=0,'Detalle evaluacion'!$C10,0)","v":0},{"$f":"+IF(MOD(G$7,'Parametros Evaluacion'!$E42+1)=0,'Detalle evaluacion'!$C10,0)","v":0},{"$f":"+IF(MOD(H$7,'Parametros Evaluacion'!$E42+1)=0,'Detalle evaluacion'!$C10,0)","v":0},{"$f":"+IF(MOD(I$7,'Parametros Evaluacion'!$E42+1)=0,'Detalle evaluacion'!$C10,0)","v":0},{"$f":"+IF(MOD(J$7,'Parametros Evaluacion'!$E42+1)=0,'Detalle evaluacion'!$C10,0)","v":0},{"$f":"+IF(MOD(K$7,'Parametros Evaluacion'!$E42+1)=0,'Detalle evaluacion'!$C10,0)","v":0},{"$f":"+IF(MOD(L$7,'Parametros Evaluacion'!$E42+1)=0,'Detalle evaluacion'!$C10,0)","v":0},{"$f":"+IF(MOD(M$7,'Parametros Evaluacion'!$E42+1)=0,'Detalle evaluacion'!$C10,0)","v":0},{"$f":"+IF(MOD(N$7,'Parametros Evaluacion'!$E42+1)=0,'Detalle evaluacion'!$C10,0)","v":0},{"$f":"+IF(MOD(O$7,'Parametros Evaluacion'!$E42+1)=0,'Detalle evaluacion'!$C10,0)","v":0},{"$f":"+IF(MOD(P$7,'Parametros Evaluacion'!$E42+1)=0,'Detalle evaluacion'!$C10,0)","v":0},{"$f":"+IF(MOD(Q$7,'Parametros Evaluacion'!$E42+1)=0,'Detalle evaluacion'!$C10,0)","v":0},{"$f":"+IF(MOD(R$7,'Parametros Evaluacion'!$E42+1)=0,'Detalle evaluacion'!$C10,0)","v":0},{"$f":"+IF(MOD(S$7,'Parametros Evaluacion'!$E42+1)=0,'Detalle evaluacion'!$C10,0)","v":0},{"$f":"+IF(MOD(T$7,'Parametros Evaluacion'!$E42+1)=0,'Detalle evaluacion'!$C10,0)","v":0},{"$f":"+IF(MOD(U$7,'Parametros Evaluacion'!$E42+1)=0,'Detalle evaluacion'!$C10,0)","v":0},{"$f":"+IF(MOD(V$7,'Parametros Evaluacion'!$E42+1)=0,'Detalle evaluacion'!$C10,0)","v":0}]
[null,{"$f":"+'Acciones a Ejecutar'!A9","v":"Reducción de la potencia reactiva (reducción del factor de potencia)"},{"$f":"IF('Acciones a Ejecutar'!B9=\"si\",'Premisas Inversiones'!C9,0)/1000000","v":0},{"$f":"+IF(MOD(D$7,'Parametros Evaluacion'!$E43+1)=0,'Detalle evaluacion'!$C11,0)","v":0},{"$f":"+IF(MOD(E$7,'Parametros Evaluacion'!$E43+1)=0,'Detalle evaluacion'!$C11,0)","v":0},{"$f":"+IF(MOD(F$7,'Parametros Evaluacion'!$E43+1)=0,'Detalle evaluacion'!$C11,0)","v":0},{"$f":"+IF(MOD(G$7,'Parametros Evaluacion'!$E43+1)=0,'Detalle evaluacion'!$C11,0)","v":0},{"$f":"+IF(MOD(H$7,'Parametros Evaluacion'!$E43+1)=0,'Detalle evaluacion'!$C11,0)","v":0},{"$f":"+IF(MOD(I$7,'Parametros Evaluacion'!$E43+1)=0,'Detalle evaluacion'!$C11,0)","v":0},{"$f":"+IF(MOD(J$7,'Parametros Evaluacion'!$E43+1)=0,'Detalle evaluacion'!$C11,0)","v":0},{"$f":"+IF(MOD(K$7,'Parametros Evaluacion'!$E43+1)=0,'Detalle evaluacion'!$C11,0)","v":0},{"$f":"+IF(MOD(L$7,'Parametros Evaluacion'!$E43+1)=0,'Detalle evaluacion'!$C11,0)","v":0},{"$f":"+IF(MOD(M$7,'Parametros Evaluacion'!$E43+1)=0,'Detalle evaluacion'!$C11,0)","v":0},{"$f":"+IF(MOD(N$7,'Parametros Evaluacion'!$E43+1)=0,'Detalle evaluacion'!$C11,0)","v":0},{"$f":"+IF(MOD(O$7,'Parametros Evaluacion'!$E43+1)=0,'Detalle evaluacion'!$C11,0)","v":0},{"$f":"+IF(MOD(P$7,'Parametros Evaluacion'!$E43+1)=0,'Detalle evaluacion'!$C11,0)","v":0},{"$f":"+IF(MOD(Q$7,'Parametros Evaluacion'!$E43+1)=0,'Detalle evaluacion'!$C11,0)","v":0},{"$f":"+IF(MOD(R$7,'Parametros Evaluacion'!$E43+1)=0,'Detalle evaluacion'!$C11,0)","v":0},{"$f":"+IF(MOD(S$7,'Parametros Evaluacion'!$E43+1)=0,'Detalle evaluacion'!$C11,0)","v":0},{"$f":"+IF(MOD(T$7,'Parametros Evaluacion'!$E43+1)=0,'Detalle evaluacion'!$C11,0)","v":0},{"$f":"+IF(MOD(U$7,'Parametros Evaluacion'!$E43+1)=0,'Detalle evaluacion'!$C11,0)","v":0},{"$f":"+IF(MOD(V$7,'Parametros Evaluacion'!$E43+1)=0,'Detalle evaluacion'!$C11,0)","v":0}]
[null,{"$f":"+'Acciones a Ejecutar'!A10","v":"Sustitución de equipos de bombeo de agua potable para reducir consumo de energía"},{"$f":"IF('Acciones a Ejecutar'!B10=\"si\",'Premisas Inversiones'!C10,0)/1000000","v":0},{"$f":"+IF(MOD(D$7,'Parametros Evaluacion'!$E44+1)=0,'Detalle evaluacion'!$C12,0)","v":0},{"$f":"+IF(MOD(E$7,'Parametros Evaluacion'!$E44+1)=0,'Detalle evaluacion'!$C12,0)","v":0},{"$f":"+IF(MOD(F$7,'Parametros Evaluacion'!$E44+1)=0,'Detalle evaluacion'!$C12,0)","v":0},{"$f":"+IF(MOD(G$7,'Parametros Evaluacion'!$E44+1)=0,'Detalle evaluacion'!$C12,0)","v":0},{"$f":"+IF(MOD(H$7,'Parametros Evaluacion'!$E44+1)=0,'Detalle evaluacion'!$C12,0)","v":0},{"$f":"+IF(MOD(I$7,'Parametros Evaluacion'!$E44+1)=0,'Detalle evaluacion'!$C12,0)","v":0},{"$f":"+IF(MOD(J$7,'Parametros Evaluacion'!$E44+1)=0,'Detalle evaluacion'!$C12,0)","v":0},{"$f":"+IF(MOD(K$7,'Parametros Evaluacion'!$E44+1)=0,'Detalle evaluacion'!$C12,0)","v":0},{"$f":"+IF(MOD(L$7,'Parametros Evaluacion'!$E44+1)=0,'Detalle evaluacion'!$C12,0)","v":0},{"$f":"+IF(MOD(M$7,'Parametros Evaluacion'!$E44+1)=0,'Detalle evaluacion'!$C12,0)","v":0},{"$f":"+IF(MOD(N$7,'Parametros Evaluacion'!$E44+1)=0,'Detalle evaluacion'!$C12,0)","v":0},{"$f":"+IF(MOD(O$7,'Parametros Evaluacion'!$E44+1)=0,'Detalle evaluacion'!$C12,0)","v":0},{"$f":"+IF(MOD(P$7,'Parametros Evaluacion'!$E44+1)=0,'Detalle evaluacion'!$C12,0)","v":0},{"$f":"+IF(MOD(Q$7,'Parametros Evaluacion'!$E44+1)=0,'Detalle evaluacion'!$C12,0)","v":0},{"$f":"+IF(MOD(R$7,'Parametros Evaluacion'!$E44+1)=0,'Detalle evaluacion'!$C12,0)","v":0},{"$f":"+IF(MOD(S$7,'Parametros Evaluacion'!$E44+1)=0,'Detalle evaluacion'!$C12,0)","v":0},{"$f":"+IF(MOD(T$7,'Parametros Evaluacion'!$E44+1)=0,'Detalle evaluacion'!$C12,0)","v":0},{"$f":"+IF(MOD(U$7,'Parametros Evaluacion'!$E44+1)=0,'Detalle evaluacion'!$C12,0)","v":0},{"$f":"+IF(MOD(V$7,'Parametros Evaluacion'!$E44+1)=0,'Detalle evaluacion'!$C12,0)","v":0}]
[null,{"$f":"+'Acciones a Ejecutar'!A11","v":"Sustitución o construcción de tanques de almacenamiento de agua para modificar políticas de operación del equipo de bombeo"},{"$f":"IF('Acciones a Ejecutar'!B11=\"si\",'Premisas Inversiones'!C11,0)/1000000","v":0},{"$f":"+IF(MOD(D$7,'Parametros Evaluacion'!$E45+1)=0,'Detalle evaluacion'!$C13,0)","v":0},{"$f":"+IF(MOD(E$7,'Parametros Evaluacion'!$E45+1)=0,'Detalle evaluacion'!$C13,0)","v":0},{"$f":"+IF(MOD(F$7,'Parametros Evaluacion'!$E45+1)=0,'Detalle evaluacion'!$C13,0)","v":0},{"$f":"+IF(MOD(G$7,'Parametros Evaluacion'!$E45+1)=0,'Detalle evaluacion'!$C13,0)","v":0},{"$f":"+IF(MOD(H$7,'Parametros Evaluacion'!$E45+1)=0,'Detalle evaluacion'!$C13,0)","v":0},{"$f":"+IF(MOD(I$7,'Parametros Evaluacion'!$E45+1)=0,'Detalle evaluacion'!$C13,0)","v":0},{"$f":"+IF(MOD(J$7,'Parametros Evaluacion'!$E45+1)=0,'Detalle evaluacion'!$C13,0)","v":0},{"$f":"+IF(MOD(K$7,'Parametros Evaluacion'!$E45+1)=0,'Detalle evaluacion'!$C13,0)","v":0},{"$f":"+IF(MOD(L$7,'Parametros Evaluacion'!$E45+1)=0,'Detalle evaluacion'!$C13,0)","v":0},{"$f":"+IF(MOD(M$7,'Parametros Evaluacion'!$E45+1)=0,'Detalle evaluacion'!$C13,0)","v":0},{"$f":"+IF(MOD(N$7,'Parametros Evaluacion'!$E45+1)=0,'Detalle evaluacion'!$C13,0)","v":0},{"$f":"+IF(MOD(O$7,'Parametros Evaluacion'!$E45+1)=0,'Detalle evaluacion'!$C13,0)","v":0},{"$f":"+IF(MOD(P$7,'Parametros Evaluacion'!$E45+1)=0,'Detalle evaluacion'!$C13,0)","v":0},{"$f":"+IF(MOD(Q$7,'Parametros Evaluacion'!$E45+1)=0,'Detalle evaluacion'!$C13,0)","v":0},{"$f":"+IF(MOD(R$7,'Parametros Evaluacion'!$E45+1)=0,'Detalle evaluacion'!$C13,0)","v":0},{"$f":"+IF(MOD(S$7,'Parametros Evaluacion'!$E45+1)=0,'Detalle evaluacion'!$C13,0)","v":0},{"$f":"+IF(MOD(T$7,'Parametros Evaluacion'!$E45+1)=0,'Detalle evaluacion'!$C13,0)","v":0},{"$f":"+IF(MOD(U$7,'Parametros Evaluacion'!$E45+1)=0,'Detalle evaluacion'!$C13,0)","v":0},{"$f":"+IF(MOD(V$7,'Parametros Evaluacion'!$E45+1)=0,'Detalle evaluacion'!$C13,0)","v":0}]
[null,{"$f":"+'Acciones a Ejecutar'!A12","v":"Automatización de equipos de bombeo para modificar políticas de operación"},{"$f":"IF('Acciones a Ejecutar'!B12=\"si\",'Premisas Inversiones'!C12,0)/1000000","v":0},{"$f":"+IF(MOD(D$7,'Parametros Evaluacion'!$E46+1)=0,'Detalle evaluacion'!$C14,0)","v":0},{"$f":"+IF(MOD(E$7,'Parametros Evaluacion'!$E46+1)=0,'Detalle evaluacion'!$C14,0)","v":0},{"$f":"+IF(MOD(F$7,'Parametros Evaluacion'!$E46+1)=0,'Detalle evaluacion'!$C14,0)","v":0},{"$f":"+IF(MOD(G$7,'Parametros Evaluacion'!$E46+1)=0,'Detalle evaluacion'!$C14,0)","v":0},{"$f":"+IF(MOD(H$7,'Parametros Evaluacion'!$E46+1)=0,'Detalle evaluacion'!$C14,0)","v":0},{"$f":"+IF(MOD(I$7,'Parametros Evaluacion'!$E46+1)=0,'Detalle evaluacion'!$C14,0)","v":0},{"$f":"+IF(MOD(J$7,'Parametros Evaluacion'!$E46+1)=0,'Detalle evaluacion'!$C14,0)","v":0},{"$f":"+IF(MOD(K$7,'Parametros Evaluacion'!$E46+1)=0,'Detalle evaluacion'!$C14,0)","v":0},{"$f":"+IF(MOD(L$7,'Parametros Evaluacion'!$E46+1)=0,'Detalle evaluacion'!$C14,0)","v":0},{"$f":"+IF(MOD(M$7,'Parametros Evaluacion'!$E46+1)=0,'Detalle evaluacion'!$C14,0)","v":0},{"$f":"+IF(MOD(N$7,'Parametros Evaluacion'!$E46+1)=0,'Detalle evaluacion'!$C14,0)","v":0},{"$f":"+IF(MOD(O$7,'Parametros Evaluacion'!$E46+1)=0,'Detalle evaluacion'!$C14,0)","v":0},{"$f":"+IF(MOD(P$7,'Parametros Evaluacion'!$E46+1)=0,'Detalle evaluacion'!$C14,0)","v":0},{"$f":"+IF(MOD(Q$7,'Parametros Evaluacion'!$E46+1)=0,'Detalle evaluacion'!$C14,0)","v":0},{"$f":"+IF(MOD(R$7,'Parametros Evaluacion'!$E46+1)=0,'Detalle evaluacion'!$C14,0)","v":0},{"$f":"+IF(MOD(S$7,'Parametros Evaluacion'!$E46+1)=0,'Detalle evaluacion'!$C14,0)","v":0},{"$f":"+IF(MOD(T$7,'Parametros Evaluacion'!$E46+1)=0,'Detalle evaluacion'!$C14,0)","v":0},{"$f":"+IF(MOD(U$7,'Parametros Evaluacion'!$E46+1)=0,'Detalle evaluacion'!$C14,0)","v":0},{"$f":"+IF(MOD(V$7,'Parametros Evaluacion'!$E46+1)=0,'Detalle evaluacion'!$C14,0)","v":0}]
[null,{"$f":"+'Acciones a Ejecutar'!A13","v":"Sustitución de bombas de alcantarillado"},{"$f":"IF('Acciones a Ejecutar'!B13=\"si\",'Premisas Inversiones'!C13,0)/1000000","v":0},{"$f":"+IF(MOD(D$7,'Parametros Evaluacion'!$E47+1)=0,'Detalle evaluacion'!$C15,0)","v":0},{"$f":"+IF(MOD(E$7,'Parametros Evaluacion'!$E47+1)=0,'Detalle evaluacion'!$C15,0)","v":0},{"$f":"+IF(MOD(F$7,'Parametros Evaluacion'!$E47+1)=0,'Detalle evaluacion'!$C15,0)","v":0},{"$f":"+IF(MOD(G$7,'Parametros Evaluacion'!$E47+1)=0,'Detalle evaluacion'!$C15,0)","v":0},{"$f":"+IF(MOD(H$7,'Parametros Evaluacion'!$E47+1)=0,'Detalle evaluacion'!$C15,0)","v":0},{"$f":"+IF(MOD(I$7,'Parametros Evaluacion'!$E47+1)=0,'Detalle evaluacion'!$C15,0)","v":0},{"$f":"+IF(MOD(J$7,'Parametros Evaluacion'!$E47+1)=0,'Detalle evaluacion'!$C15,0)","v":0},{"$f":"+IF(MOD(K$7,'Parametros Evaluacion'!$E47+1)=0,'Detalle evaluacion'!$C15,0)","v":0},{"$f":"+IF(MOD(L$7,'Parametros Evaluacion'!$E47+1)=0,'Detalle evaluacion'!$C15,0)","v":0},{"$f":"+IF(MOD(M$7,'Parametros Evaluacion'!$E47+1)=0,'Detalle evaluacion'!$C15,0)","v":0},{"$f":"+IF(MOD(N$7,'Parametros Evaluacion'!$E47+1)=0,'Detalle evaluacion'!$C15,0)","v":0},{"$f":"+IF(MOD(O$7,'Parametros Evaluacion'!$E47+1)=0,'Detalle evaluacion'!$C15,0)","v":0},{"$f":"+IF(MOD(P$7,'Parametros Evaluacion'!$E47+1)=0,'Detalle evaluacion'!$C15,0)","v":0},{"$f":"+IF(MOD(Q$7,'Parametros Evaluacion'!$E47+1)=0,'Detalle evaluacion'!$C15,0)","v":0},{"$f":"+IF(MOD(R$7,'Parametros Evaluacion'!$E47+1)=0,'Detalle evaluacion'!$C15,0)","v":0},{"$f":"+IF(MOD(S$7,'Parametros Evaluacion'!$E47+1)=0,'Detalle evaluacion'!$C15,0)","v":0},{"$f":"+IF(MOD(T$7,'Parametros Evaluacion'!$E47+1)=0,'Detalle evaluacion'!$C15,0)","v":0},{"$f":"+IF(MOD(U$7,'Parametros Evaluacion'!$E47+1)=0,'Detalle evaluacion'!$C15,0)","v":0},{"$f":"+IF(MOD(V$7,'Parametros Evaluacion'!$E47+1)=0,'Detalle evaluacion'!$C15,0)","v":0}]
[null,{"$f":"+'Acciones a Ejecutar'!A14","v":"Reducción de gastos de energía en plantas de tratamiento de aguas residuales (PTAR)"},{"$f":"IF('Acciones a Ejecutar'!B14=\"si\",'Premisas Inversiones'!C14,0)/1000000","v":0},{"$f":"+IF(MOD(D$7,'Parametros Evaluacion'!$E48+1)=0,'Detalle evaluacion'!$C16,0)","v":0},{"$f":"+IF(MOD(E$7,'Parametros Evaluacion'!$E48+1)=0,'Detalle evaluacion'!$C16,0)","v":0},{"$f":"+IF(MOD(F$7,'Parametros Evaluacion'!$E48+1)=0,'Detalle evaluacion'!$C16,0)","v":0},{"$f":"+IF(MOD(G$7,'Parametros Evaluacion'!$E48+1)=0,'Detalle evaluacion'!$C16,0)","v":0},{"$f":"+IF(MOD(H$7,'Parametros Evaluacion'!$E48+1)=0,'Detalle evaluacion'!$C16,0)","v":0},{"$f":"+IF(MOD(I$7,'Parametros Evaluacion'!$E48+1)=0,'Detalle evaluacion'!$C16,0)","v":0},{"$f":"+IF(MOD(J$7,'Parametros Evaluacion'!$E48+1)=0,'Detalle evaluacion'!$C16,0)","v":0},{"$f":"+IF(MOD(K$7,'Parametros Evaluacion'!$E48+1)=0,'Detalle evaluacion'!$C16,0)","v":0},{"$f":"+IF(MOD(L$7,'Parametros Evaluacion'!$E48+1)=0,'Detalle evaluacion'!$C16,0)","v":0},{"$f":"+IF(MOD(M$7,'Parametros Evaluacion'!$E48+1)=0,'Detalle evaluacion'!$C16,0)","v":0},{"$f":"+IF(MOD(N$7,'Parametros Evaluacion'!$E48+1)=0,'Detalle evaluacion'!$C16,0)","v":0},{"$f":"+IF(MOD(O$7,'Parametros Evaluacion'!$E48+1)=0,'Detalle evaluacion'!$C16,0)","v":0},{"$f":"+IF(MOD(P$7,'Parametros Evaluacion'!$E48+1)=0,'Detalle evaluacion'!$C16,0)","v":0},{"$f":"+IF(MOD(Q$7,'Parametros Evaluacion'!$E48+1)=0,'Detalle evaluacion'!$C16,0)","v":0},{"$f":"+IF(MOD(R$7,'Parametros Evaluacion'!$E48+1)=0,'Detalle evaluacion'!$C16,0)","v":0},{"$f":"+IF(MOD(S$7,'Parametros Evaluacion'!$E48+1)=0,'Detalle evaluacion'!$C16,0)","v":0},{"$f":"+IF(MOD(T$7,'Parametros Evaluacion'!$E48+1)=0,'Detalle evaluacion'!$C16,0)","v":0},{"$f":"+IF(MOD(U$7,'Parametros Evaluacion'!$E48+1)=0,'Detalle evaluacion'!$C16,0)","v":0},{"$f":"+IF(MOD(V$7,'Parametros Evaluacion'!$E48+1)=0,'Detalle evaluacion'!$C16,0)","v":0}]
[null,{"$f":"+'Acciones a Ejecutar'!A15","v":"Elaboración de una auditoría energética"},{"$f":"IF('Acciones a Ejecutar'!B15=\"si\",'Premisas Inversiones'!C15,0)/1000000","v":0},{"$f":"+IF(MOD(D$7,'Parametros Evaluacion'!$E49+1)=0,'Detalle evaluacion'!$C17,0)","v":0},{"$f":"+IF(MOD(E$7,'Parametros Evaluacion'!$E49+1)=0,'Detalle evaluacion'!$C17,0)","v":0},{"$f":"+IF(MOD(F$7,'Parametros Evaluacion'!$E49+1)=0,'Detalle evaluacion'!$C17,0)","v":0},{"$f":"+IF(MOD(G$7,'Parametros Evaluacion'!$E49+1)=0,'Detalle evaluacion'!$C17,0)","v":0},{"$f":"+IF(MOD(H$7,'Parametros Evaluacion'!$E49+1)=0,'Detalle evaluacion'!$C17,0)","v":0},{"$f":"+IF(MOD(I$7,'Parametros Evaluacion'!$E49+1)=0,'Detalle evaluacion'!$C17,0)","v":0},{"$f":"+IF(MOD(J$7,'Parametros Evaluacion'!$E49+1)=0,'Detalle evaluacion'!$C17,0)","v":0},{"$f":"+IF(MOD(K$7,'Parametros Evaluacion'!$E49+1)=0,'Detalle evaluacion'!$C17,0)","v":0},{"$f":"+IF(MOD(L$7,'Parametros Evaluacion'!$E49+1)=0,'Detalle evaluacion'!$C17,0)","v":0},{"$f":"+IF(MOD(M$7,'Parametros Evaluacion'!$E49+1)=0,'Detalle evaluacion'!$C17,0)","v":0},{"$f":"+IF(MOD(N$7,'Parametros Evaluacion'!$E49+1)=0,'Detalle evaluacion'!$C17,0)","v":0},{"$f":"+IF(MOD(O$7,'Parametros Evaluacion'!$E49+1)=0,'Detalle evaluacion'!$C17,0)","v":0},{"$f":"+IF(MOD(P$7,'Parametros Evaluacion'!$E49+1)=0,'Detalle evaluacion'!$C17,0)","v":0},{"$f":"+IF(MOD(Q$7,'Parametros Evaluacion'!$E49+1)=0,'Detalle evaluacion'!$C17,0)","v":0},{"$f":"+IF(MOD(R$7,'Parametros Evaluacion'!$E49+1)=0,'Detalle evaluacion'!$C17,0)","v":0},{"$f":"+IF(MOD(S$7,'Parametros Evaluacion'!$E49+1)=0,'Detalle evaluacion'!$C17,0)","v":0},{"$f":"+IF(MOD(T$7,'Parametros Evaluacion'!$E49+1)=0,'Detalle evaluacion'!$C17,0)","v":0},{"$f":"+IF(MOD(U$7,'Parametros Evaluacion'!$E49+1)=0,'Detalle evaluacion'!$C17,0)","v":0},{"$f":"+IF(MOD(V$7,'Parametros Evaluacion'!$E49+1)=0,'Detalle evaluacion'!$C17,0)","v":0}]
[null,"Total Inversión PAI para reducción de gastos de energía eléctrica",{"$f":"+SUM(C10:C17)","v":0},0,0,0,0,0,0,0,0,0,0,0,0,0,0,0,0,0,0,0]
[null,"2. PAI para incrementar la productividad del personal "]
[null,{"$f":"+'Acciones a Ejecutar'!A18","v":"Programa de capacitación y profesionalización para incrementar la productividad del personal."},{"$f":"IF('Acciones a Ejecutar'!B18=\"si\",'Premisas Inversiones'!C18,0)/1000000","v":0},{"$f":"+IF(MOD(D$7,'Parametros Evaluacion'!$E50+1)=0,'Detalle evaluacion'!$C20,0)","v":0},{"$f":"+IF(MOD(E$7,'Parametros Evaluacion'!$E50+1)=0,'Detalle evaluacion'!$C20,0)","v":0},{"$f":"+IF(MOD(F$7,'Parametros Evaluacion'!$E50+1)=0,'Detalle evaluacion'!$C20,0)","v":0},{"$f":"+IF(MOD(G$7,'Parametros Evaluacion'!$E50+1)=0,'Detalle evaluacion'!$C20,0)","v":0},{"$f":"+IF(MOD(H$7,'Parametros Evaluacion'!$E50+1)=0,'Detalle evaluacion'!$C20,0)","v":0},{"$f":"+IF(MOD(I$7,'Parametros Evaluacion'!$E50+1)=0,'Detalle evaluacion'!$C20,0)","v":0},{"$f":"+IF(MOD(J$7,'Parametros Evaluacion'!$E50+1)=0,'Detalle evaluacion'!$C20,0)","v":0},{"$f":"+IF(MOD(K$7,'Parametros Evaluacion'!$E50+1)=0,'Detalle evaluacion'!$C20,0)","v":0},{"$f":"+IF(MOD(L$7,'Parametros Evaluacion'!$E50+1)=0,'Detalle evaluacion'!$C20,0)","v":0},{"$f":"+IF(MOD(M$7,'Parametros Evaluacion'!$E50+1)=0,'Detalle evaluacion'!$C20,0)","v":0},{"$f":"+IF(MOD(N$7,'Parametros Evaluacion'!$E50+1)=0,'Detalle evaluacion'!$C20,0)","v":0},{"$f":"+IF(MOD(O$7,'Parametros Evaluacion'!$E50+1)=0,'Detalle evaluacion'!$C20,0)","v":0},{"$f":"+IF(MOD(P$7,'Parametros Evaluacion'!$E50+1)=0,'Detalle evaluacion'!$C20,0)","v":0},{"$f":"+IF(MOD(Q$7,'Parametros Evaluacion'!$E50+1)=0,'Detalle evaluacion'!$C20,0)","v":0},{"$f":"+IF(MOD(R$7,'Parametros Evaluacion'!$E50+1)=0,'Detalle evaluacion'!$C20,0)","v":0},{"$f":"+IF(MOD(S$7,'Parametros Evaluacion'!$E50+1)=0,'Detalle evaluacion'!$C20,0)","v":0},{"$f":"+IF(MOD(T$7,'Parametros Evaluacion'!$E50+1)=0,'Detalle evaluacion'!$C20,0)","v":0},{"$f":"+IF(MOD(U$7,'Parametros Evaluacion'!$E50+1)=0,'Detalle evaluacion'!$C20,0)","v":0},{"$f":"+IF(MOD(V$7,'Parametros Evaluacion'!$E50+1)=0,'Detalle evaluacion'!$C20,0)","v":0}]
[null,{"$f":"+'Acciones a Ejecutar'!A19","v":"Revisión del manual de funciones y cargos del personal del OO"},{"$f":"IF('Acciones a Ejecutar'!B19=\"si\",'Premisas Inversiones'!C19,0)/1000000","v":0},{"$f":"+IF(MOD(D$7,'Parametros Evaluacion'!$E51+1)=0,'Detalle evaluacion'!$C21,0)","v":0},{"$f":"+IF(MOD(E$7,'Parametros Evaluacion'!$E51+1)=0,'Detalle evaluacion'!$C21,0)","v":0},{"$f":"+IF(MOD(F$7,'Parametros Evaluacion'!$E51+1)=0,'Detalle evaluacion'!$C21,0)","v":0},{"$f":"+IF(MOD(G$7,'Parametros Evaluacion'!$E51+1)=0,'Detalle evaluacion'!$C21,0)","v":0},{"$f":"+IF(MOD(H$7,'Parametros Evaluacion'!$E51+1)=0,'Detalle evaluacion'!$C21,0)","v":0},{"$f":"+IF(MOD(I$7,'Parametros Evaluacion'!$E51+1)=0,'Detalle evaluacion'!$C21,0)","v":0},{"$f":"+IF(MOD(J$7,'Parametros Evaluacion'!$E51+1)=0,'Detalle evaluacion'!$C21,0)","v":0},{"$f":"+IF(MOD(K$7,'Parametros Evaluacion'!$E51+1)=0,'Detalle evaluacion'!$C21,0)","v":0},{"$f":"+IF(MOD(L$7,'Parametros Evaluacion'!$E51+1)=0,'Detalle evaluacion'!$C21,0)","v":0},{"$f":"+IF(MOD(M$7,'Parametros Evaluacion'!$E51+1)=0,'Detalle evaluacion'!$C21,0)","v":0},{"$f":"+IF(MOD(N$7,'Parametros Evaluacion'!$E51+1)=0,'Detalle evaluacion'!$C21,0)","v":0},{"$f":"+IF(MOD(O$7,'Parametros Evaluacion'!$E51+1)=0,'Detalle evaluacion'!$C21,0)","v":0},{"$f":"+IF(MOD(P$7,'Parametros Evaluacion'!$E51+1)=0,'Detalle evaluacion'!$C21,0)","v":0},{"$f":"+IF(MOD(Q$7,'Parametros Evaluacion'!$E51+1)=0,'Detalle evaluacion'!$C21,0)","v":0},{"$f":"+IF(MOD(R$7,'Parametros Evaluacion'!$E51+1)=0,'Detalle evaluacion'!$C21,0)","v":0},{"$f":"+IF(MOD(S$7,'Parametros Evaluacion'!$E51+1)=0,'Detalle evaluacion'!$C21,0)","v":0},{"$f":"+IF(MOD(T$7,'Parametros Evaluacion'!$E51+1)=0,'Detalle evaluacion'!$C21,0)","v":0},{"$f":"+IF(MOD(U$7,'Parametros Evaluacion'!$E51+1)=0,'Detalle evaluacion'!$C21,0)","v":0},{"$f":"+IF(MOD(V$7,'Parametros Evaluacion'!$E51+1)=0,'Detalle evaluacion'!$C21,0)","v":0}]
[null,{"$f":"+'Acciones a Ejecutar'!A20","v":"Establecimiento de un programa de retiro voluntario y obligado"},{"$f":"IF('Acciones a Ejecutar'!B20=\"si\",'Premisas Inversiones'!C20,0)/1000000","v":0},{"$f":"+IF(MOD(D$7,'Parametros Evaluacion'!$E53+1)=0,'Detalle evaluacion'!$C22,0)","v":0},{"$f":"+IF(MOD(E$7,'Parametros Evaluacion'!$E53+1)=0,'Detalle evaluacion'!$C22,0)","v":0},{"$f":"+IF(MOD(F$7,'Parametros Evaluacion'!$E53+1)=0,'Detalle evaluacion'!$C22,0)","v":0},{"$f":"+IF(MOD(G$7,'Parametros Evaluacion'!$E53+1)=0,'Detalle evaluacion'!$C22,0)","v":0},{"$f":"+IF(MOD(H$7,'Parametros Evaluacion'!$E53+1)=0,'Detalle evaluacion'!$C22,0)","v":0},{"$f":"+IF(MOD(I$7,'Parametros Evaluacion'!$E53+1)=0,'Detalle evaluacion'!$C22,0)","v":0},{"$f":"+IF(MOD(J$7,'Parametros Evaluacion'!$E53+1)=0,'Detalle evaluacion'!$C22,0)","v":0},{"$f":"+IF(MOD(K$7,'Parametros Evaluacion'!$E53+1)=0,'Detalle evaluacion'!$C22,0)","v":0},{"$f":"+IF(MOD(L$7,'Parametros Evaluacion'!$E53+1)=0,'Detalle evaluacion'!$C22,0)","v":0},{"$f":"+IF(MOD(M$7,'Parametros Evaluacion'!$E53+1)=0,'Detalle evaluacion'!$C22,0)","v":0},{"$f":"+IF(MOD(N$7,'Parametros Evaluacion'!$E53+1)=0,'Detalle evaluacion'!$C22,0)","v":0},{"$f":"+IF(MOD(O$7,'Parametros Evaluacion'!$E53+1)=0,'Detalle evaluacion'!$C22,0)","v":0},{"$f":"+IF(MOD(P$7,'Parametros Evaluacion'!$E53+1)=0,'Detalle evaluacion'!$C22,0)","v":0},{"$f":"+IF(MOD(Q$7,'Parametros Evaluacion'!$E53+1)=0,'Detalle evaluacion'!$C22,0)","v":0},{"$f":"+IF(MOD(R$7,'Parametros Evaluacion'!$E53+1)=0,'Detalle evaluacion'!$C22,0)","v":0},{"$f":"+IF(MOD(S$7,'Parametros Evaluacion'!$E53+1)=0,'Detalle evaluacion'!$C22,0)","v":0},{"$f":"+IF(MOD(T$7,'Parametros Evaluacion'!$E53+1)=0,'Detalle evaluacion'!$C22,0)","v":0},{"$f":"+IF(MOD(U$7,'Parametros Evaluacion'!$E53+1)=0,'Detalle evaluacion'!$C22,0)","v":0},{"$f":"+IF(MOD(V$7,'Parametros Evaluacion'!$E53+1)=0,'Detalle evaluacion'!$C22,0)","v":0}]
[null,"Total Inversión PAI para incrementar la productividad del personal",{"$f":"SUM(C20:C22)","v":0},0,0,0,0,0,0,0,0,0,0,0,0,0,0,0,0,0,0,0]
[null,"3. PAI para mejora de la Gestión Comercial"]
[null,{"$f":"+'Acciones a Ejecutar'!A23","v":"Ajuste de consumos de cuota fija"},{"$f":"IF('Acciones a Ejecutar'!B23=\"si\",'Premisas Inversiones'!C23,0)/1000000","v":0},{"$f":"+IF(MOD(D$7,'Parametros Evaluacion'!$E54+1)=0,'Detalle evaluacion'!$C25,0)","v":0},{"$f":"+IF(MOD(E$7,'Parametros Evaluacion'!$E54+1)=0,'Detalle evaluacion'!$C25,0)","v":0},{"$f":"+IF(MOD(F$7,'Parametros Evaluacion'!$E54+1)=0,'Detalle evaluacion'!$C25,0)","v":0},{"$f":"+IF(MOD(G$7,'Parametros Evaluacion'!$E54+1)=0,'Detalle evaluacion'!$C25,0)","v":0},{"$f":"+IF(MOD(H$7,'Parametros Evaluacion'!$E54+1)=0,'Detalle evaluacion'!$C25,0)","v":0},{"$f":"+IF(MOD(I$7,'Parametros Evaluacion'!$E54+1)=0,'Detalle evaluacion'!$C25,0)","v":0},{"$f":"+IF(MOD(J$7,'Parametros Evaluacion'!$E54+1)=0,'Detalle evaluacion'!$C25,0)","v":0},{"$f":"+IF(MOD(K$7,'Parametros Evaluacion'!$E54+1)=0,'Detalle evaluacion'!$C25,0)","v":0},{"$f":"+IF(MOD(L$7,'Parametros Evaluacion'!$E54+1)=0,'Detalle evaluacion'!$C25,0)","v":0},{"$f":"+IF(MOD(M$7,'Parametros Evaluacion'!$E54+1)=0,'Detalle evaluacion'!$C25,0)","v":0},{"$f":"+IF(MOD(N$7,'Parametros Evaluacion'!$E54+1)=0,'Detalle evaluacion'!$C25,0)","v":0},{"$f":"+IF(MOD(O$7,'Parametros Evaluacion'!$E54+1)=0,'Detalle evaluacion'!$C25,0)","v":0},{"$f":"+IF(MOD(P$7,'Parametros Evaluacion'!$E54+1)=0,'Detalle evaluacion'!$C25,0)","v":0},{"$f":"+IF(MOD(Q$7,'Parametros Evaluacion'!$E54+1)=0,'Detalle evaluacion'!$C25,0)","v":0},{"$f":"+IF(MOD(R$7,'Parametros Evaluacion'!$E54+1)=0,'Detalle evaluacion'!$C25,0)","v":0},{"$f":"+IF(MOD(S$7,'Parametros Evaluacion'!$E54+1)=0,'Detalle evaluacion'!$C25,0)","v":0},{"$f":"+IF(MOD(T$7,'Parametros Evaluacion'!$E54+1)=0,'Detalle evaluacion'!$C25,0)","v":0},{"$f":"+IF(MOD(U$7,'Parametros Evaluacion'!$E54+1)=0,'Detalle evaluacion'!$C25,0)","v":0},{"$f":"+IF(MOD(V$7,'Parametros Evaluacion'!$E54+1)=0,'Detalle evaluacion'!$C25,0)","v":0}]
[null,{"$f":"+'Acciones a Ejecutar'!A24","v":"Corrección de errores de micromedición mediante sustitución de medidores."},{"$f":"IF('Acciones a Ejecutar'!B24=\"si\",'Premisas Inversiones'!C24,0)/1000000","v":0},{"$f":"+IF(MOD(D$7,'Parametros Evaluacion'!$E55+1)=0,'Detalle evaluacion'!$C26,0)","v":0},{"$f":"+IF(MOD(E$7,'Parametros Evaluacion'!$E55+1)=0,'Detalle evaluacion'!$C26,0)","v":0},{"$f":"+IF(MOD(F$7,'Parametros Evaluacion'!$E55+1)=0,'Detalle evaluacion'!$C26,0)","v":0},{"$f":"+IF(MOD(G$7,'Parametros Evaluacion'!$E55+1)=0,'Detalle evaluacion'!$C26,0)","v":0},{"$f":"+IF(MOD(H$7,'Parametros Evaluacion'!$E55+1)=0,'Detalle evaluacion'!$C26,0)","v":0},{"$f":"+IF(MOD(I$7,'Parametros Evaluacion'!$E55+1)=0,'Detalle evaluacion'!$C26,0)","v":0},{"$f":"+IF(MOD(J$7,'Parametros Evaluacion'!$E55+1)=0,'Detalle evaluacion'!$C26,0)","v":0},{"$f":"+IF(MOD(K$7,'Parametros Evaluacion'!$E55+1)=0,'Detalle evaluacion'!$C26,0)","v":0},{"$f":"+IF(MOD(L$7,'Parametros Evaluacion'!$E55+1)=0,'Detalle evaluacion'!$C26,0)","v":0},{"$f":"+IF(MOD(M$7,'Parametros Evaluacion'!$E55+1)=0,'Detalle evaluacion'!$C26,0)","v":0},{"$f":"+IF(MOD(N$7,'Parametros Evaluacion'!$E55+1)=0,'Detalle evaluacion'!$C26,0)","v":0},{"$f":"+IF(MOD(O$7,'Parametros Evaluacion'!$E55+1)=0,'Detalle evaluacion'!$C26,0)","v":0},{"$f":"+IF(MOD(P$7,'Parametros Evaluacion'!$E55+1)=0,'Detalle evaluacion'!$C26,0)","v":0},{"$f":"+IF(MOD(Q$7,'Parametros Evaluacion'!$E55+1)=0,'Detalle evaluacion'!$C26,0)","v":0},{"$f":"+IF(MOD(R$7,'Parametros Evaluacion'!$E55+1)=0,'Detalle evaluacion'!$C26,0)","v":0},{"$f":"+IF(MOD(S$7,'Parametros Evaluacion'!$E55+1)=0,'Detalle evaluacion'!$C26,0)","v":0},{"$f":"+IF(MOD(T$7,'Parametros Evaluacion'!$E55+1)=0,'Detalle evaluacion'!$C26,0)","v":0},{"$f":"+IF(MOD(U$7,'Parametros Evaluacion'!$E55+1)=0,'Detalle evaluacion'!$C26,0)","v":0},{"$f":"+IF(MOD(V$7,'Parametros Evaluacion'!$E55+1)=0,'Detalle evaluacion'!$C26,0)","v":0}]
[null,{"$f":"+'Acciones a Ejecutar'!A25","v":"Impartición de cursos de formación de recursos humanos en eficiencia comercial"},{"$f":"IF('Acciones a Ejecutar'!B25=\"si\",'Premisas Inversiones'!C25,0)/1000000","v":0},{"$f":"+IF(MOD(D$7,'Parametros Evaluacion'!$E56+1)=0,'Detalle evaluacion'!$C27,0)","v":0},{"$f":"+IF(MOD(E$7,'Parametros Evaluacion'!$E56+1)=0,'Detalle evaluacion'!$C27,0)","v":0},{"$f":"+IF(MOD(F$7,'Parametros Evaluacion'!$E56+1)=0,'Detalle evaluacion'!$C27,0)","v":0},{"$f":"+IF(MOD(G$7,'Parametros Evaluacion'!$E56+1)=0,'Detalle evaluacion'!$C27,0)","v":0},{"$f":"+IF(MOD(H$7,'Parametros Evaluacion'!$E56+1)=0,'Detalle evaluacion'!$C27,0)","v":0},{"$f":"+IF(MOD(I$7,'Parametros Evaluacion'!$E56+1)=0,'Detalle evaluacion'!$C27,0)","v":0},{"$f":"+IF(MOD(J$7,'Parametros Evaluacion'!$E56+1)=0,'Detalle evaluacion'!$C27,0)","v":0},{"$f":"+IF(MOD(K$7,'Parametros Evaluacion'!$E56+1)=0,'Detalle evaluacion'!$C27,0)","v":0},{"$f":"+IF(MOD(L$7,'Parametros Evaluacion'!$E56+1)=0,'Detalle evaluacion'!$C27,0)","v":0},{"$f":"+IF(MOD(M$7,'Parametros Evaluacion'!$E56+1)=0,'Detalle evaluacion'!$C27,0)","v":0},{"$f":"+IF(MOD(N$7,'Parametros Evaluacion'!$E56+1)=0,'Detalle evaluacion'!$C27,0)","v":0},{"$f":"+IF(MOD(O$7,'Parametros Evaluacion'!$E56+1)=0,'Detalle evaluacion'!$C27,0)","v":0},{"$f":"+IF(MOD(P$7,'Parametros Evaluacion'!$E56+1)=0,'Detalle evaluacion'!$C27,0)","v":0},{"$f":"+IF(MOD(Q$7,'Parametros Evaluacion'!$E56+1)=0,'Detalle evaluacion'!$C27,0)","v":0},{"$f":"+IF(MOD(R$7,'Parametros Evaluacion'!$E56+1)=0,'Detalle evaluacion'!$C27,0)","v":0},{"$f":"+IF(MOD(S$7,'Parametros Evaluacion'!$E56+1)=0,'Detalle evaluacion'!$C27,0)","v":0},{"$f":"+IF(MOD(T$7,'Parametros Evaluacion'!$E56+1)=0,'Detalle evaluacion'!$C27,0)","v":0},{"$f":"+IF(MOD(U$7,'Parametros Evaluacion'!$E56+1)=0,'Detalle evaluacion'!$C27,0)","v":0},{"$f":"+IF(MOD(V$7,'Parametros Evaluacion'!$E56+1)=0,'Detalle evaluacion'!$C27,0)","v":0}]
[null,{"$f":"+'Acciones a Ejecutar'!A26","v":"Impartición de cursos de formación de recursos humanos en atención a usuarios"},{"$f":"IF('Acciones a Ejecutar'!B26=\"si\",'Premisas Inversiones'!C26,0)/1000000","v":0},{"$f":"+IF(MOD(D$7,'Parametros Evaluacion'!$E57+1)=0,'Detalle evaluacion'!$C28,0)","v":0},{"$f":"+IF(MOD(E$7,'Parametros Evaluacion'!$E57+1)=0,'Detalle evaluacion'!$C28,0)","v":0},{"$f":"+IF(MOD(F$7,'Parametros Evaluacion'!$E57+1)=0,'Detalle evaluacion'!$C28,0)","v":0},{"$f":"+IF(MOD(G$7,'Parametros Evaluacion'!$E57+1)=0,'Detalle evaluacion'!$C28,0)","v":0},{"$f":"+IF(MOD(H$7,'Parametros Evaluacion'!$E57+1)=0,'Detalle evaluacion'!$C28,0)","v":0},{"$f":"+IF(MOD(I$7,'Parametros Evaluacion'!$E57+1)=0,'Detalle evaluacion'!$C28,0)","v":0},{"$f":"+IF(MOD(J$7,'Parametros Evaluacion'!$E57+1)=0,'Detalle evaluacion'!$C28,0)","v":0},{"$f":"+IF(MOD(K$7,'Parametros Evaluacion'!$E57+1)=0,'Detalle evaluacion'!$C28,0)","v":0},{"$f":"+IF(MOD(L$7,'Parametros Evaluacion'!$E57+1)=0,'Detalle evaluacion'!$C28,0)","v":0},{"$f":"+IF(MOD(M$7,'Parametros Evaluacion'!$E57+1)=0,'Detalle evaluacion'!$C28,0)","v":0},{"$f":"+IF(MOD(N$7,'Parametros Evaluacion'!$E57+1)=0,'Detalle evaluacion'!$C28,0)","v":0},{"$f":"+IF(MOD(O$7,'Parametros Evaluacion'!$E57+1)=0,'Detalle evaluacion'!$C28,0)","v":0},{"$f":"+IF(MOD(P$7,'Parametros Evaluacion'!$E57+1)=0,'Detalle evaluacion'!$C28,0)","v":0},{"$f":"+IF(MOD(Q$7,'Parametros Evaluacion'!$E57+1)=0,'Detalle evaluacion'!$C28,0)","v":0},{"$f":"+IF(MOD(R$7,'Parametros Evaluacion'!$E57+1)=0,'Detalle evaluacion'!$C28,0)","v":0},{"$f":"+IF(MOD(S$7,'Parametros Evaluacion'!$E57+1)=0,'Detalle evaluacion'!$C28,0)","v":0},{"$f":"+IF(MOD(T$7,'Parametros Evaluacion'!$E57+1)=0,'Detalle evaluacion'!$C28,0)","v":0},{"$f":"+IF(MOD(U$7,'Parametros Evaluacion'!$E57+1)=0,'Detalle evaluacion'!$C28,0)","v":0},{"$f":"+IF(MOD(V$7,'Parametros Evaluacion'!$E57+1)=0,'Detalle evaluacion'!$C28,0)","v":0}]
[null,{"$f":"+'Acciones a Ejecutar'!A27","v":"Firma de convenios con bancos y otras instituciones para ampliar las opciones de pago de los servicios de agua y saneamiento"},{"$f":"IF('Acciones a Ejecutar'!B27=\"si\",'Premisas Inversiones'!C27,0)/1000000","v":0},{"$f":"+IF(MOD(D$7,'Parametros Evaluacion'!$E58+1)=0,'Detalle evaluacion'!$C29,0)","v":0},{"$f":"+IF(MOD(E$7,'Parametros Evaluacion'!$E58+1)=0,'Detalle evaluacion'!$C29,0)","v":0},{"$f":"+IF(MOD(F$7,'Parametros Evaluacion'!$E58+1)=0,'Detalle evaluacion'!$C29,0)","v":0},{"$f":"+IF(MOD(G$7,'Parametros Evaluacion'!$E58+1)=0,'Detalle evaluacion'!$C29,0)","v":0},{"$f":"+IF(MOD(H$7,'Parametros Evaluacion'!$E58+1)=0,'Detalle evaluacion'!$C29,0)","v":0},{"$f":"+IF(MOD(I$7,'Parametros Evaluacion'!$E58+1)=0,'Detalle evaluacion'!$C29,0)","v":0},{"$f":"+IF(MOD(J$7,'Parametros Evaluacion'!$E58+1)=0,'Detalle evaluacion'!$C29,0)","v":0},{"$f":"+IF(MOD(K$7,'Parametros Evaluacion'!$E58+1)=0,'Detalle evaluacion'!$C29,0)","v":0},{"$f":"+IF(MOD(L$7,'Parametros Evaluacion'!$E58+1)=0,'Detalle evaluacion'!$C29,0)","v":0},{"$f":"+IF(MOD(M$7,'Parametros Evaluacion'!$E58+1)=0,'Detalle evaluacion'!$C29,0)","v":0},{"$f":"+IF(MOD(N$7,'Parametros Evaluacion'!$E58+1)=0,'Detalle evaluacion'!$C29,0)","v":0},{"$f":"+IF(MOD(O$7,'Parametros Evaluacion'!$E58+1)=0,'Detalle evaluacion'!$C29,0)","v":0},{"$f":"+IF(MOD(P$7,'Parametros Evaluacion'!$E58+1)=0,'Detalle evaluacion'!$C29,0)","v":0},{"$f":"+IF(MOD(Q$7,'Parametros Evaluacion'!$E58+1)=0,'Detalle evaluacion'!$C29,0)","v":0},{"$f":"+IF(MOD(R$7,'Parametros Evaluacion'!$E58+1)=0,'Detalle evaluacion'!$C29,0)","v":0},{"$f":"+IF(MOD(S$7,'Parametros Evaluacion'!$E58+1)=0,'Detalle evaluacion'!$C29,0)","v":0},{"$f":"+IF(MOD(T$7,'Parametros Evaluacion'!$E58+1)=0,'Detalle evaluacion'!$C29,0)","v":0},{"$f":"+IF(MOD(U$7,'Parametros Evaluacion'!$E58+1)=0,'Detalle evaluacion'!$C29,0)","v":0},{"$f":"+IF(MOD(V$7,'Parametros Evaluacion'!$E58+1)=0,'Detalle evaluacion'!$C29,0)","v":0}]
[null,{"$f":"+'Acciones a Ejecutar'!A28","v":"Mejoras a la facturación mediante un nuevo sistema comercial"},{"$f":"IF('Acciones a Ejecutar'!B28=\"si\",'Premisas Inversiones'!C28,0)/1000000","v":0},{"$f":"+IF(MOD(D$7,'Parametros Evaluacion'!$E59+1)=0,'Detalle evaluacion'!$C30,0)","v":0},{"$f":"+IF(MOD(E$7,'Parametros Evaluacion'!$E59+1)=0,'Detalle evaluacion'!$C30,0)","v":0},{"$f":"+IF(MOD(F$7,'Parametros Evaluacion'!$E59+1)=0,'Detalle evaluacion'!$C30,0)","v":0},{"$f":"+IF(MOD(G$7,'Parametros Evaluacion'!$E59+1)=0,'Detalle evaluacion'!$C30,0)","v":0},{"$f":"+IF(MOD(H$7,'Parametros Evaluacion'!$E59+1)=0,'Detalle evaluacion'!$C30,0)","v":0},{"$f":"+IF(MOD(I$7,'Parametros Evaluacion'!$E59+1)=0,'Detalle evaluacion'!$C30,0)","v":0},{"$f":"+IF(MOD(J$7,'Parametros Evaluacion'!$E59+1)=0,'Detalle evaluacion'!$C30,0)","v":0},{"$f":"+IF(MOD(K$7,'Parametros Evaluacion'!$E59+1)=0,'Detalle evaluacion'!$C30,0)","v":0},{"$f":"+IF(MOD(L$7,'Parametros Evaluacion'!$E59+1)=0,'Detalle evaluacion'!$C30,0)","v":0},{"$f":"+IF(MOD(M$7,'Parametros Evaluacion'!$E59+1)=0,'Detalle evaluacion'!$C30,0)","v":0},{"$f":"+IF(MOD(N$7,'Parametros Evaluacion'!$E59+1)=0,'Detalle evaluacion'!$C30,0)","v":0},{"$f":"+IF(MOD(O$7,'Parametros Evaluacion'!$E59+1)=0,'Detalle evaluacion'!$C30,0)","v":0},{"$f":"+IF(MOD(P$7,'Parametros Evaluacion'!$E59+1)=0,'Detalle evaluacion'!$C30,0)","v":0},{"$f":"+IF(MOD(Q$7,'Parametros Evaluacion'!$E59+1)=0,'Detalle evaluacion'!$C30,0)","v":0},{"$f":"+IF(MOD(R$7,'Parametros Evaluacion'!$E59+1)=0,'Detalle evaluacion'!$C30,0)","v":0},{"$f":"+IF(MOD(S$7,'Parametros Evaluacion'!$E59+1)=0,'Detalle evaluacion'!$C30,0)","v":0},{"$f":"+IF(MOD(T$7,'Parametros Evaluacion'!$E59+1)=0,'Detalle evaluacion'!$C30,0)","v":0},{"$f":"+IF(MOD(U$7,'Parametros Evaluacion'!$E59+1)=0,'Detalle evaluacion'!$C30,0)","v":0},{"$f":"+IF(MOD(V$7,'Parametros Evaluacion'!$E59+1)=0,'Detalle evaluacion'!$C30,0)","v":0}]
[null,{"$f":"+'Acciones a Ejecutar'!A29","v":"Mejoras en la cobranza mediante esquemas que faciliten el pago."},{"$f":"IF('Acciones a Ejecutar'!B29=\"si\",'Premisas Inversiones'!C29,0)/1000000","v":0},{"$f":"+IF(MOD(D$7,'Parametros Evaluacion'!$E60+1)=0,'Detalle evaluacion'!$C31,0)","v":0},{"$f":"+IF(MOD(E$7,'Parametros Evaluacion'!$E60+1)=0,'Detalle evaluacion'!$C31,0)","v":0},{"$f":"+IF(MOD(F$7,'Parametros Evaluacion'!$E60+1)=0,'Detalle evaluacion'!$C31,0)","v":0},{"$f":"+IF(MOD(G$7,'Parametros Evaluacion'!$E60+1)=0,'Detalle evaluacion'!$C31,0)","v":0},{"$f":"+IF(MOD(H$7,'Parametros Evaluacion'!$E60+1)=0,'Detalle evaluacion'!$C31,0)","v":0},{"$f":"+IF(MOD(I$7,'Parametros Evaluacion'!$E60+1)=0,'Detalle evaluacion'!$C31,0)","v":0},{"$f":"+IF(MOD(J$7,'Parametros Evaluacion'!$E60+1)=0,'Detalle evaluacion'!$C31,0)","v":0},{"$f":"+IF(MOD(K$7,'Parametros Evaluacion'!$E60+1)=0,'Detalle evaluacion'!$C31,0)","v":0},{"$f":"+IF(MOD(L$7,'Parametros Evaluacion'!$E60+1)=0,'Detalle evaluacion'!$C31,0)","v":0},{"$f":"+IF(MOD(M$7,'Parametros Evaluacion'!$E60+1)=0,'Detalle evaluacion'!$C31,0)","v":0},{"$f":"+IF(MOD(N$7,'Parametros Evaluacion'!$E60+1)=0,'Detalle evaluacion'!$C31,0)","v":0},{"$f":"+IF(MOD(O$7,'Parametros Evaluacion'!$E60+1)=0,'Detalle evaluacion'!$C31,0)","v":0},{"$f":"+IF(MOD(P$7,'Parametros Evaluacion'!$E60+1)=0,'Detalle evaluacion'!$C31,0)","v":0},{"$f":"+IF(MOD(Q$7,'Parametros Evaluacion'!$E60+1)=0,'Detalle evaluacion'!$C31,0)","v":0},{"$f":"+IF(MOD(R$7,'Parametros Evaluacion'!$E60+1)=0,'Detalle evaluacion'!$C31,0)","v":0},{"$f":"+IF(MOD(S$7,'Parametros Evaluacion'!$E60+1)=0,'Detalle evaluacion'!$C31,0)","v":0},{"$f":"+IF(MOD(T$7,'Parametros Evaluacion'!$E60+1)=0,'Detalle evaluacion'!$C31,0)","v":0},{"$f":"+IF(MOD(U$7,'Parametros Evaluacion'!$E60+1)=0,'Detalle evaluacion'!$C31,0)","v":0},{"$f":"+IF(MOD(V$7,'Parametros Evaluacion'!$E60+1)=0,'Detalle evaluacion'!$C31,0)","v":0}]
[null,{"$f":"+'Acciones a Ejecutar'!A30","v":"Localización y regularización de tomas clandestinas"},{"$f":"IF('Acciones a Ejecutar'!B30=\"si\",'Premisas Inversiones'!C30,0)/1000000","v":0},{"$f":"+IF(MOD(D$7,'Parametros Evaluacion'!$E61+1)=0,'Detalle evaluacion'!$C32,0)","v":0},{"$f":"+IF(MOD(E$7,'Parametros Evaluacion'!$E61+1)=0,'Detalle evaluacion'!$C32,0)","v":0},{"$f":"+IF(MOD(F$7,'Parametros Evaluacion'!$E61+1)=0,'Detalle evaluacion'!$C32,0)","v":0},{"$f":"+IF(MOD(G$7,'Parametros Evaluacion'!$E61+1)=0,'Detalle evaluacion'!$C32,0)","v":0},{"$f":"+IF(MOD(H$7,'Parametros Evaluacion'!$E61+1)=0,'Detalle evaluacion'!$C32,0)","v":0},{"$f":"+IF(MOD(I$7,'Parametros Evaluacion'!$E61+1)=0,'Detalle evaluacion'!$C32,0)","v":0},{"$f":"+IF(MOD(J$7,'Parametros Evaluacion'!$E61+1)=0,'Detalle evaluacion'!$C32,0)","v":0},{"$f":"+IF(MOD(K$7,'Parametros Evaluacion'!$E61+1)=0,'Detalle evaluacion'!$C32,0)","v":0},{"$f":"+IF(MOD(L$7,'Parametros Evaluacion'!$E61+1)=0,'Detalle evaluacion'!$C32,0)","v":0},{"$f":"+IF(MOD(M$7,'Parametros Evaluacion'!$E61+1)=0,'Detalle evaluacion'!$C32,0)","v":0},{"$f":"+IF(MOD(N$7,'Parametros Evaluacion'!$E61+1)=0,'Detalle evaluacion'!$C32,0)","v":0},{"$f":"+IF(MOD(O$7,'Parametros Evaluacion'!$E61+1)=0,'Detalle evaluacion'!$C32,0)","v":0},{"$f":"+IF(MOD(P$7,'Parametros Evaluacion'!$E61+1)=0,'Detalle evaluacion'!$C32,0)","v":0},{"$f":"+IF(MOD(Q$7,'Parametros Evaluacion'!$E61+1)=0,'Detalle evaluacion'!$C32,0)","v":0},{"$f":"+IF(MOD(R$7,'Parametros Evaluacion'!$E61+1)=0,'Detalle evaluacion'!$C32,0)","v":0},{"$f":"+IF(MOD(S$7,'Parametros Evaluacion'!$E61+1)=0,'Detalle evaluacion'!$C32,0)","v":0},{"$f":"+IF(MOD(T$7,'Parametros Evaluacion'!$E61+1)=0,'Detalle evaluacion'!$C32,0)","v":0},{"$f":"+IF(MOD(U$7,'Parametros Evaluacion'!$E61+1)=0,'Detalle evaluacion'!$C32,0)","v":0},{"$f":"+IF(MOD(V$7,'Parametros Evaluacion'!$E61+1)=0,'Detalle evaluacion'!$C32,0)","v":0}]
[null,{"$f":"+'Acciones a Ejecutar'!A31","v":"Censo de usuarios para mejorar el padrón. Establecimiento de esquemas de actualización continua del padrón."},{"$f":"IF('Acciones a Ejecutar'!B31=\"si\",'Premisas Inversiones'!C31,0)/1000000","v":0},{"$f":"+IF(MOD(D$7,'Parametros Evaluacion'!$E62+1)=0,'Detalle evaluacion'!$C33,0)","v":0},{"$f":"+IF(MOD(E$7,'Parametros Evaluacion'!$E62+1)=0,'Detalle evaluacion'!$C33,0)","v":0},{"$f":"+IF(MOD(F$7,'Parametros Evaluacion'!$E62+1)=0,'Detalle evaluacion'!$C33,0)","v":0},{"$f":"+IF(MOD(G$7,'Parametros Evaluacion'!$E62+1)=0,'Detalle evaluacion'!$C33,0)","v":0},{"$f":"+IF(MOD(H$7,'Parametros Evaluacion'!$E62+1)=0,'Detalle evaluacion'!$C33,0)","v":0},{"$f":"+IF(MOD(I$7,'Parametros Evaluacion'!$E62+1)=0,'Detalle evaluacion'!$C33,0)","v":0},{"$f":"+IF(MOD(J$7,'Parametros Evaluacion'!$E62+1)=0,'Detalle evaluacion'!$C33,0)","v":0},{"$f":"+IF(MOD(K$7,'Parametros Evaluacion'!$E62+1)=0,'Detalle evaluacion'!$C33,0)","v":0},{"$f":"+IF(MOD(L$7,'Parametros Evaluacion'!$E62+1)=0,'Detalle evaluacion'!$C33,0)","v":0},{"$f":"+IF(MOD(M$7,'Parametros Evaluacion'!$E62+1)=0,'Detalle evaluacion'!$C33,0)","v":0},{"$f":"+IF(MOD(N$7,'Parametros Evaluacion'!$E62+1)=0,'Detalle evaluacion'!$C33,0)","v":0},{"$f":"+IF(MOD(O$7,'Parametros Evaluacion'!$E62+1)=0,'Detalle evaluacion'!$C33,0)","v":0},{"$f":"+IF(MOD(P$7,'Parametros Evaluacion'!$E62+1)=0,'Detalle evaluacion'!$C33,0)","v":0},{"$f":"+IF(MOD(Q$7,'Parametros Evaluacion'!$E62+1)=0,'Detalle evaluacion'!$C33,0)","v":0},{"$f":"+IF(MOD(R$7,'Parametros Evaluacion'!$E62+1)=0,'Detalle evaluacion'!$C33,0)","v":0},{"$f":"+IF(MOD(S$7,'Parametros Evaluacion'!$E62+1)=0,'Detalle evaluacion'!$C33,0)","v":0},{"$f":"+IF(MOD(T$7,'Parametros Evaluacion'!$E62+1)=0,'Detalle evaluacion'!$C33,0)","v":0},{"$f":"+IF(MOD(U$7,'Parametros Evaluacion'!$E62+1)=0,'Detalle evaluacion'!$C33,0)","v":0},{"$f":"+IF(MOD(V$7,'Parametros Evaluacion'!$E62+1)=0,'Detalle evaluacion'!$C33,0)","v":0}]
[null,{"$f":"+'Acciones a Ejecutar'!A32","v":"Sistema de cómputo para altas y bajas del padrón de usuarios."},{"$f":"IF('Acciones a Ejecutar'!B32=\"si\",'Premisas Inversiones'!C32,0)/1000000","v":0},{"$f":"+IF(MOD(D$7,'Parametros Evaluacion'!$E63+1)=0,'Detalle evaluacion'!$C34,0)","v":0},{"$f":"+IF(MOD(E$7,'Parametros Evaluacion'!$E63+1)=0,'Detalle evaluacion'!$C34,0)","v":0},{"$f":"+IF(MOD(F$7,'Parametros Evaluacion'!$E63+1)=0,'Detalle evaluacion'!$C34,0)","v":0},{"$f":"+IF(MOD(G$7,'Parametros Evaluacion'!$E63+1)=0,'Detalle evaluacion'!$C34,0)","v":0},{"$f":"+IF(MOD(H$7,'Parametros Evaluacion'!$E63+1)=0,'Detalle evaluacion'!$C34,0)","v":0},{"$f":"+IF(MOD(I$7,'Parametros Evaluacion'!$E63+1)=0,'Detalle evaluacion'!$C34,0)","v":0},{"$f":"+IF(MOD(J$7,'Parametros Evaluacion'!$E63+1)=0,'Detalle evaluacion'!$C34,0)","v":0},{"$f":"+IF(MOD(K$7,'Parametros Evaluacion'!$E63+1)=0,'Detalle evaluacion'!$C34,0)","v":0},{"$f":"+IF(MOD(L$7,'Parametros Evaluacion'!$E63+1)=0,'Detalle evaluacion'!$C34,0)","v":0},{"$f":"+IF(MOD(M$7,'Parametros Evaluacion'!$E63+1)=0,'Detalle evaluacion'!$C34,0)","v":0},{"$f":"+IF(MOD(N$7,'Parametros Evaluacion'!$E63+1)=0,'Detalle evaluacion'!$C34,0)","v":0},{"$f":"+IF(MOD(O$7,'Parametros Evaluacion'!$E63+1)=0,'Detalle evaluacion'!$C34,0)","v":0},{"$f":"+IF(MOD(P$7,'Parametros Evaluacion'!$E63+1)=0,'Detalle evaluacion'!$C34,0)","v":0},{"$f":"+IF(MOD(Q$7,'Parametros Evaluacion'!$E63+1)=0,'Detalle evaluacion'!$C34,0)","v":0},{"$f":"+IF(MOD(R$7,'Parametros Evaluacion'!$E63+1)=0,'Detalle evaluacion'!$C34,0)","v":0},{"$f":"+IF(MOD(S$7,'Parametros Evaluacion'!$E63+1)=0,'Detalle evaluacion'!$C34,0)","v":0},{"$f":"+IF(MOD(T$7,'Parametros Evaluacion'!$E63+1)=0,'Detalle evaluacion'!$C34,0)","v":0},{"$f":"+IF(MOD(U$7,'Parametros Evaluacion'!$E63+1)=0,'Detalle evaluacion'!$C34,0)","v":0},{"$f":"+IF(MOD(V$7,'Parametros Evaluacion'!$E63+1)=0,'Detalle evaluacion'!$C34,0)","v":0}]
[null,{"$f":"+'Acciones a Ejecutar'!A33","v":"Estudio tarifario con el fin de realizar la actualización de las tarifas de agua"},{"$f":"IF('Acciones a Ejecutar'!B33=\"si\",'Premisas Inversiones'!C33,0)/1000000","v":0},{"$f":"+IF(MOD(D$7,'Parametros Evaluacion'!$E64+1)=0,'Detalle evaluacion'!$C35,0)","v":0},{"$f":"+IF(MOD(E$7,'Parametros Evaluacion'!$E64+1)=0,'Detalle evaluacion'!$C35,0)","v":0},{"$f":"+IF(MOD(F$7,'Parametros Evaluacion'!$E64+1)=0,'Detalle evaluacion'!$C35,0)","v":0},{"$f":"+IF(MOD(G$7,'Parametros Evaluacion'!$E64+1)=0,'Detalle evaluacion'!$C35,0)","v":0},{"$f":"+IF(MOD(H$7,'Parametros Evaluacion'!$E64+1)=0,'Detalle evaluacion'!$C35,0)","v":0},{"$f":"+IF(MOD(I$7,'Parametros Evaluacion'!$E64+1)=0,'Detalle evaluacion'!$C35,0)","v":0},{"$f":"+IF(MOD(J$7,'Parametros Evaluacion'!$E64+1)=0,'Detalle evaluacion'!$C35,0)","v":0},{"$f":"+IF(MOD(K$7,'Parametros Evaluacion'!$E64+1)=0,'Detalle evaluacion'!$C35,0)","v":0},{"$f":"+IF(MOD(L$7,'Parametros Evaluacion'!$E64+1)=0,'Detalle evaluacion'!$C35,0)","v":0},{"$f":"+IF(MOD(M$7,'Parametros Evaluacion'!$E64+1)=0,'Detalle evaluacion'!$C35,0)","v":0},{"$f":"+IF(MOD(N$7,'Parametros Evaluacion'!$E64+1)=0,'Detalle evaluacion'!$C35,0)","v":0},{"$f":"+IF(MOD(O$7,'Parametros Evaluacion'!$E64+1)=0,'Detalle evaluacion'!$C35,0)","v":0},{"$f":"+IF(MOD(P$7,'Parametros Evaluacion'!$E64+1)=0,'Detalle evaluacion'!$C35,0)","v":0},{"$f":"+IF(MOD(Q$7,'Parametros Evaluacion'!$E64+1)=0,'Detalle evaluacion'!$C35,0)","v":0},{"$f":"+IF(MOD(R$7,'Parametros Evaluacion'!$E64+1)=0,'Detalle evaluacion'!$C35,0)","v":0},{"$f":"+IF(MOD(S$7,'Parametros Evaluacion'!$E64+1)=0,'Detalle evaluacion'!$C35,0)","v":0},{"$f":"+IF(MOD(T$7,'Parametros Evaluacion'!$E64+1)=0,'Detalle evaluacion'!$C35,0)","v":0},{"$f":"+IF(MOD(U$7,'Parametros Evaluacion'!$E64+1)=0,'Detalle evaluacion'!$C35,0)","v":0},{"$f":"+IF(MOD(V$7,'Parametros Evaluacion'!$E64+1)=0,'Detalle evaluacion'!$C35,0)","v":0}]
[null,{"$f":"+'Acciones a Ejecutar'!A34","v":"Modificaciones a la estructura tarifaria"},{"$f":"IF('Acciones a Ejecutar'!B34=\"si\",'Premisas Inversiones'!C34,0)/1000000","v":0},{"$f":"+IF(MOD(D$7,'Parametros Evaluacion'!$E65+1)=0,'Detalle evaluacion'!$C36,0)","v":0},{"$f":"+IF(MOD(E$7,'Parametros Evaluacion'!$E65+1)=0,'Detalle evaluacion'!$C36,0)","v":0},{"$f":"+IF(MOD(F$7,'Parametros Evaluacion'!$E65+1)=0,'Detalle evaluacion'!$C36,0)","v":0},{"$f":"+IF(MOD(G$7,'Parametros Evaluacion'!$E65+1)=0,'Detalle evaluacion'!$C36,0)","v":0},{"$f":"+IF(MOD(H$7,'Parametros Evaluacion'!$E65+1)=0,'Detalle evaluacion'!$C36,0)","v":0},{"$f":"+IF(MOD(I$7,'Parametros Evaluacion'!$E65+1)=0,'Detalle evaluacion'!$C36,0)","v":0},{"$f":"+IF(MOD(J$7,'Parametros Evaluacion'!$E65+1)=0,'Detalle evaluacion'!$C36,0)","v":0},{"$f":"+IF(MOD(K$7,'Parametros Evaluacion'!$E65+1)=0,'Detalle evaluacion'!$C36,0)","v":0},{"$f":"+IF(MOD(L$7,'Parametros Evaluacion'!$E65+1)=0,'Detalle evaluacion'!$C36,0)","v":0},{"$f":"+IF(MOD(M$7,'Parametros Evaluacion'!$E65+1)=0,'Detalle evaluacion'!$C36,0)","v":0},{"$f":"+IF(MOD(N$7,'Parametros Evaluacion'!$E65+1)=0,'Detalle evaluacion'!$C36,0)","v":0},{"$f":"+IF(MOD(O$7,'Parametros Evaluacion'!$E65+1)=0,'Detalle evaluacion'!$C36,0)","v":0},{"$f":"+IF(MOD(P$7,'Parametros Evaluacion'!$E65+1)=0,'Detalle evaluacion'!$C36,0)","v":0},{"$f":"+IF(MOD(Q$7,'Parametros Evaluacion'!$E65+1)=0,'Detalle evaluacion'!$C36,0)","v":0},{"$f":"+IF(MOD(R$7,'Parametros Evaluacion'!$E65+1)=0,'Detalle evaluacion'!$C36,0)","v":0},{"$f":"+IF(MOD(S$7,'Parametros Evaluacion'!$E65+1)=0,'Detalle evaluacion'!$C36,0)","v":0},{"$f":"+IF(MOD(T$7,'Parametros Evaluacion'!$E65+1)=0,'Detalle evaluacion'!$C36,0)","v":0},{"$f":"+IF(MOD(U$7,'Parametros Evaluacion'!$E65+1)=0,'Detalle evaluacion'!$C36,0)","v":0},{"$f":"+IF(MOD(V$7,'Parametros Evaluacion'!$E65+1)=0,'Detalle evaluacion'!$C36,0)","v":0}]
[null,{"$f":"+'Acciones a Ejecutar'!A35","v":"Reformas para lograr que las tarifas se actualicen de manera continua"},{"$f":"IF('Acciones a Ejecutar'!B35=\"si\",'Premisas Inversiones'!C35,0)/1000000","v":0},{"$f":"+IF(MOD(D$7,'Parametros Evaluacion'!$E66+1)=0,'Detalle evaluacion'!$C37,0)","v":0},{"$f":"+IF(MOD(E$7,'Parametros Evaluacion'!$E66+1)=0,'Detalle evaluacion'!$C37,0)","v":0},{"$f":"+IF(MOD(F$7,'Parametros Evaluacion'!$E66+1)=0,'Detalle evaluacion'!$C37,0)","v":0},{"$f":"+IF(MOD(G$7,'Parametros Evaluacion'!$E66+1)=0,'Detalle evaluacion'!$C37,0)","v":0},{"$f":"+IF(MOD(H$7,'Parametros Evaluacion'!$E66+1)=0,'Detalle evaluacion'!$C37,0)","v":0},{"$f":"+IF(MOD(I$7,'Parametros Evaluacion'!$E66+1)=0,'Detalle evaluacion'!$C37,0)","v":0},{"$f":"+IF(MOD(J$7,'Parametros Evaluacion'!$E66+1)=0,'Detalle evaluacion'!$C37,0)","v":0},{"$f":"+IF(MOD(K$7,'Parametros Evaluacion'!$E66+1)=0,'Detalle evaluacion'!$C37,0)","v":0},{"$f":"+IF(MOD(L$7,'Parametros Evaluacion'!$E66+1)=0,'Detalle evaluacion'!$C37,0)","v":0},{"$f":"+IF(MOD(M$7,'Parametros Evaluacion'!$E66+1)=0,'Detalle evaluacion'!$C37,0)","v":0},{"$f":"+IF(MOD(N$7,'Parametros Evaluacion'!$E66+1)=0,'Detalle evaluacion'!$C37,0)","v":0},{"$f":"+IF(MOD(O$7,'Parametros Evaluacion'!$E66+1)=0,'Detalle evaluacion'!$C37,0)","v":0},{"$f":"+IF(MOD(P$7,'Parametros Evaluacion'!$E66+1)=0,'Detalle evaluacion'!$C37,0)","v":0},{"$f":"+IF(MOD(Q$7,'Parametros Evaluacion'!$E66+1)=0,'Detalle evaluacion'!$C37,0)","v":0},{"$f":"+IF(MOD(R$7,'Parametros Evaluacion'!$E66+1)=0,'Detalle evaluacion'!$C37,0)","v":0},{"$f":"+IF(MOD(S$7,'Parametros Evaluacion'!$E66+1)=0,'Detalle evaluacion'!$C37,0)","v":0},{"$f":"+IF(MOD(T$7,'Parametros Evaluacion'!$E66+1)=0,'Detalle evaluacion'!$C37,0)","v":0},{"$f":"+IF(MOD(U$7,'Parametros Evaluacion'!$E66+1)=0,'Detalle evaluacion'!$C37,0)","v":0},{"$f":"+IF(MOD(V$7,'Parametros Evaluacion'!$E66+1)=0,'Detalle evaluacion'!$C37,0)","v":0}]
[null,{"$f":"+'Acciones a Ejecutar'!A36","v":"Reformas al marco legal para que el OO pueda establecer tarifas adecuadas"},{"$f":"IF('Acciones a Ejecutar'!B36=\"si\",'Premisas Inversiones'!C36,0)/1000000","v":0},{"$f":"+IF(MOD(D$7,'Parametros Evaluacion'!$E67+1)=0,'Detalle evaluacion'!$C38,0)","v":0},{"$f":"+IF(MOD(E$7,'Parametros Evaluacion'!$E67+1)=0,'Detalle evaluacion'!$C38,0)","v":0},{"$f":"+IF(MOD(F$7,'Parametros Evaluacion'!$E67+1)=0,'Detalle evaluacion'!$C38,0)","v":0},{"$f":"+IF(MOD(G$7,'Parametros Evaluacion'!$E67+1)=0,'Detalle evaluacion'!$C38,0)","v":0},{"$f":"+IF(MOD(H$7,'Parametros Evaluacion'!$E67+1)=0,'Detalle evaluacion'!$C38,0)","v":0},{"$f":"+IF(MOD(I$7,'Parametros Evaluacion'!$E67+1)=0,'Detalle evaluacion'!$C38,0)","v":0},{"$f":"+IF(MOD(J$7,'Parametros Evaluacion'!$E67+1)=0,'Detalle evaluacion'!$C38,0)","v":0},{"$f":"+IF(MOD(K$7,'Parametros Evaluacion'!$E67+1)=0,'Detalle evaluacion'!$C38,0)","v":0},{"$f":"+IF(MOD(L$7,'Parametros Evaluacion'!$E67+1)=0,'Detalle evaluacion'!$C38,0)","v":0},{"$f":"+IF(MOD(M$7,'Parametros Evaluacion'!$E67+1)=0,'Detalle evaluacion'!$C38,0)","v":0},{"$f":"+IF(MOD(N$7,'Parametros Evaluacion'!$E67+1)=0,'Detalle evaluacion'!$C38,0)","v":0},{"$f":"+IF(MOD(O$7,'Parametros Evaluacion'!$E67+1)=0,'Detalle evaluacion'!$C38,0)","v":0},{"$f":"+IF(MOD(P$7,'Parametros Evaluacion'!$E67+1)=0,'Detalle evaluacion'!$C38,0)","v":0},{"$f":"+IF(MOD(Q$7,'Parametros Evaluacion'!$E67+1)=0,'Detalle evaluacion'!$C38,0)","v":0},{"$f":"+IF(MOD(R$7,'Parametros Evaluacion'!$E67+1)=0,'Detalle evaluacion'!$C38,0)","v":0},{"$f":"+IF(MOD(S$7,'Parametros Evaluacion'!$E67+1)=0,'Detalle evaluacion'!$C38,0)","v":0},{"$f":"+IF(MOD(T$7,'Parametros Evaluacion'!$E67+1)=0,'Detalle evaluacion'!$C38,0)","v":0},{"$f":"+IF(MOD(U$7,'Parametros Evaluacion'!$E67+1)=0,'Detalle evaluacion'!$C38,0)","v":0},{"$f":"+IF(MOD(V$7,'Parametros Evaluacion'!$E67+1)=0,'Detalle evaluacion'!$C38,0)","v":0}]
[null,"Total PAI para mejora de la Gestión Comercial",{"$f":"SUM(C25:C38)","v":0},0,0,0,0,0,0,0,0,0,0,0,0,0,0,0,0,0,0,0]
[null,"4. PAI para reducción de Pérdidas Físicas de Agua"]
[null,{"$f":"+'Acciones a Ejecutar'!A39","v":"Localización y reparación de fugas en tanques"},{"$f":"IF('Acciones a Ejecutar'!B39=\"si\",'Premisas Inversiones'!C39,0)/1000000","v":0},{"$f":"+IF(MOD(D$7,'Parametros Evaluacion'!$E68+1)=0,'Detalle evaluacion'!$C41,0)","v":0},{"$f":"+IF(MOD(E$7,'Parametros Evaluacion'!$E68+1)=0,'Detalle evaluacion'!$C41,0)","v":0},{"$f":"+IF(MOD(F$7,'Parametros Evaluacion'!$E68+1)=0,'Detalle evaluacion'!$C41,0)","v":0},{"$f":"+IF(MOD(G$7,'Parametros Evaluacion'!$E68+1)=0,'Detalle evaluacion'!$C41,0)","v":0},{"$f":"+IF(MOD(H$7,'Parametros Evaluacion'!$E68+1)=0,'Detalle evaluacion'!$C41,0)","v":0},{"$f":"+IF(MOD(I$7,'Parametros Evaluacion'!$E68+1)=0,'Detalle evaluacion'!$C41,0)","v":0},{"$f":"+IF(MOD(J$7,'Parametros Evaluacion'!$E68+1)=0,'Detalle evaluacion'!$C41,0)","v":0},{"$f":"+IF(MOD(K$7,'Parametros Evaluacion'!$E68+1)=0,'Detalle evaluacion'!$C41,0)","v":0},{"$f":"+IF(MOD(L$7,'Parametros Evaluacion'!$E68+1)=0,'Detalle evaluacion'!$C41,0)","v":0},{"$f":"+IF(MOD(M$7,'Parametros Evaluacion'!$E68+1)=0,'Detalle evaluacion'!$C41,0)","v":0},{"$f":"+IF(MOD(N$7,'Parametros Evaluacion'!$E68+1)=0,'Detalle evaluacion'!$C41,0)","v":0},{"$f":"+IF(MOD(O$7,'Parametros Evaluacion'!$E68+1)=0,'Detalle evaluacion'!$C41,0)","v":0},{"$f":"+IF(MOD(P$7,'Parametros Evaluacion'!$E68+1)=0,'Detalle evaluacion'!$C41,0)","v":0},{"$f":"+IF(MOD(Q$7,'Parametros Evaluacion'!$E68+1)=0,'Detalle evaluacion'!$C41,0)","v":0},{"$f":"+IF(MOD(R$7,'Parametros Evaluacion'!$E68+1)=0,'Detalle evaluacion'!$C41,0)","v":0},{"$f":"+IF(MOD(S$7,'Parametros Evaluacion'!$E68+1)=0,'Detalle evaluacion'!$C41,0)","v":0},{"$f":"+IF(MOD(T$7,'Parametros Evaluacion'!$E68+1)=0,'Detalle evaluacion'!$C41,0)","v":0},{"$f":"+IF(MOD(U$7,'Parametros Evaluacion'!$E68+1)=0,'Detalle evaluacion'!$C41,0)","v":0},{"$f":"+IF(MOD(V$7,'Parametros Evaluacion'!$E68+1)=0,'Detalle evaluacion'!$C41,0)","v":0}]
[null,{"$f":"+'Acciones a Ejecutar'!A40","v":"Localización y reparación de fugas en tuberías principales y secundarias"},{"$f":"IF('Acciones a Ejecutar'!B40=\"si\",'Premisas Inversiones'!C40,0)/1000000","v":0},{"$f":"+IF(MOD(D$7,'Parametros Evaluacion'!$E69+1)=0,'Detalle evaluacion'!$C42,0)","v":0},{"$f":"+IF(MOD(E$7,'Parametros Evaluacion'!$E69+1)=0,'Detalle evaluacion'!$C42,0)","v":0},{"$f":"+IF(MOD(F$7,'Parametros Evaluacion'!$E69+1)=0,'Detalle evaluacion'!$C42,0)","v":0},{"$f":"+IF(MOD(G$7,'Parametros Evaluacion'!$E69+1)=0,'Detalle evaluacion'!$C42,0)","v":0},{"$f":"+IF(MOD(H$7,'Parametros Evaluacion'!$E69+1)=0,'Detalle evaluacion'!$C42,0)","v":0},{"$f":"+IF(MOD(I$7,'Parametros Evaluacion'!$E69+1)=0,'Detalle evaluacion'!$C42,0)","v":0},{"$f":"+IF(MOD(J$7,'Parametros Evaluacion'!$E69+1)=0,'Detalle evaluacion'!$C42,0)","v":0},{"$f":"+IF(MOD(K$7,'Parametros Evaluacion'!$E69+1)=0,'Detalle evaluacion'!$C42,0)","v":0},{"$f":"+IF(MOD(L$7,'Parametros Evaluacion'!$E69+1)=0,'Detalle evaluacion'!$C42,0)","v":0},{"$f":"+IF(MOD(M$7,'Parametros Evaluacion'!$E69+1)=0,'Detalle evaluacion'!$C42,0)","v":0},{"$f":"+IF(MOD(N$7,'Parametros Evaluacion'!$E69+1)=0,'Detalle evaluacion'!$C42,0)","v":0},{"$f":"+IF(MOD(O$7,'Parametros Evaluacion'!$E69+1)=0,'Detalle evaluacion'!$C42,0)","v":0},{"$f":"+IF(MOD(P$7,'Parametros Evaluacion'!$E69+1)=0,'Detalle evaluacion'!$C42,0)","v":0},{"$f":"+IF(MOD(Q$7,'Parametros Evaluacion'!$E69+1)=0,'Detalle evaluacion'!$C42,0)","v":0},{"$f":"+IF(MOD(R$7,'Parametros Evaluacion'!$E69+1)=0,'Detalle evaluacion'!$C42,0)","v":0},{"$f":"+IF(MOD(S$7,'Parametros Evaluacion'!$E69+1)=0,'Detalle evaluacion'!$C42,0)","v":0},{"$f":"+IF(MOD(T$7,'Parametros Evaluacion'!$E69+1)=0,'Detalle evaluacion'!$C42,0)","v":0},{"$f":"+IF(MOD(U$7,'Parametros Evaluacion'!$E69+1)=0,'Detalle evaluacion'!$C42,0)","v":0},{"$f":"+IF(MOD(V$7,'Parametros Evaluacion'!$E69+1)=0,'Detalle evaluacion'!$C42,0)","v":0}]
[null,{"$f":"+'Acciones a Ejecutar'!A41","v":"Instalación de micromedidores en las tomas"},{"$f":"IF('Acciones a Ejecutar'!B41=\"si\",'Premisas Inversiones'!C41,0)/1000000","v":0},{"$f":"+IF(MOD(D$7,'Parametros Evaluacion'!$E70+1)=0,'Detalle evaluacion'!$C43,0)","v":0},{"$f":"+IF(MOD(E$7,'Parametros Evaluacion'!$E70+1)=0,'Detalle evaluacion'!$C43,0)","v":0},{"$f":"+IF(MOD(F$7,'Parametros Evaluacion'!$E70+1)=0,'Detalle evaluacion'!$C43,0)","v":0},{"$f":"+IF(MOD(G$7,'Parametros Evaluacion'!$E70+1)=0,'Detalle evaluacion'!$C43,0)","v":0},{"$f":"+IF(MOD(H$7,'Parametros Evaluacion'!$E70+1)=0,'Detalle evaluacion'!$C43,0)","v":0},{"$f":"+IF(MOD(I$7,'Parametros Evaluacion'!$E70+1)=0,'Detalle evaluacion'!$C43,0)","v":0},{"$f":"+IF(MOD(J$7,'Parametros Evaluacion'!$E70+1)=0,'Detalle evaluacion'!$C43,0)","v":0},{"$f":"+IF(MOD(K$7,'Parametros Evaluacion'!$E70+1)=0,'Detalle evaluacion'!$C43,0)","v":0},{"$f":"+IF(MOD(L$7,'Parametros Evaluacion'!$E70+1)=0,'Detalle evaluacion'!$C43,0)","v":0},{"$f":"+IF(MOD(M$7,'Parametros Evaluacion'!$E70+1)=0,'Detalle evaluacion'!$C43,0)","v":0},{"$f":"+IF(MOD(N$7,'Parametros Evaluacion'!$E70+1)=0,'Detalle evaluacion'!$C43,0)","v":0},{"$f":"+IF(MOD(O$7,'Parametros Evaluacion'!$E70+1)=0,'Detalle evaluacion'!$C43,0)","v":0},{"$f":"+IF(MOD(P$7,'Parametros Evaluacion'!$E70+1)=0,'Detalle evaluacion'!$C43,0)","v":0},{"$f":"+IF(MOD(Q$7,'Parametros Evaluacion'!$E70+1)=0,'Detalle evaluacion'!$C43,0)","v":0},{"$f":"+IF(MOD(R$7,'Parametros Evaluacion'!$E70+1)=0,'Detalle evaluacion'!$C43,0)","v":0},{"$f":"+IF(MOD(S$7,'Parametros Evaluacion'!$E70+1)=0,'Detalle evaluacion'!$C43,0)","v":0},{"$f":"+IF(MOD(T$7,'Parametros Evaluacion'!$E70+1)=0,'Detalle evaluacion'!$C43,0)","v":0},{"$f":"+IF(MOD(U$7,'Parametros Evaluacion'!$E70+1)=0,'Detalle evaluacion'!$C43,0)","v":0},{"$f":"+IF(MOD(V$7,'Parametros Evaluacion'!$E70+1)=0,'Detalle evaluacion'!$C43,0)","v":0}]
[null,{"$f":"+'Acciones a Ejecutar'!A42","v":"Sistematización de lectura de micromedidores en tomas e incorporación de lecturas al sistema de facturación y cobranza"},{"$f":"IF('Acciones a Ejecutar'!B42=\"si\",'Premisas Inversiones'!C42,0)/1000000","v":0},{"$f":"+IF(MOD(D$7,'Parametros Evaluacion'!$E71+1)=0,'Detalle evaluacion'!$C44,0)","v":0},{"$f":"+IF(MOD(E$7,'Parametros Evaluacion'!$E71+1)=0,'Detalle evaluacion'!$C44,0)","v":0},{"$f":"+IF(MOD(F$7,'Parametros Evaluacion'!$E71+1)=0,'Detalle evaluacion'!$C44,0)","v":0},{"$f":"+IF(MOD(G$7,'Parametros Evaluacion'!$E71+1)=0,'Detalle evaluacion'!$C44,0)","v":0},{"$f":"+IF(MOD(H$7,'Parametros Evaluacion'!$E71+1)=0,'Detalle evaluacion'!$C44,0)","v":0},{"$f":"+IF(MOD(I$7,'Parametros Evaluacion'!$E71+1)=0,'Detalle evaluacion'!$C44,0)","v":0},{"$f":"+IF(MOD(J$7,'Parametros Evaluacion'!$E71+1)=0,'Detalle evaluacion'!$C44,0)","v":0},{"$f":"+IF(MOD(K$7,'Parametros Evaluacion'!$E71+1)=0,'Detalle evaluacion'!$C44,0)","v":0},{"$f":"+IF(MOD(L$7,'Parametros Evaluacion'!$E71+1)=0,'Detalle evaluacion'!$C44,0)","v":0},{"$f":"+IF(MOD(M$7,'Parametros Evaluacion'!$E71+1)=0,'Detalle evaluacion'!$C44,0)","v":0},{"$f":"+IF(MOD(N$7,'Parametros Evaluacion'!$E71+1)=0,'Detalle evaluacion'!$C44,0)","v":0},{"$f":"+IF(MOD(O$7,'Parametros Evaluacion'!$E71+1)=0,'Detalle evaluacion'!$C44,0)","v":0},{"$f":"+IF(MOD(P$7,'Parametros Evaluacion'!$E71+1)=0,'Detalle evaluacion'!$C44,0)","v":0},{"$f":"+IF(MOD(Q$7,'Parametros Evaluacion'!$E71+1)=0,'Detalle evaluacion'!$C44,0)","v":0},{"$f":"+IF(MOD(R$7,'Parametros Evaluacion'!$E71+1)=0,'Detalle evaluacion'!$C44,0)","v":0},{"$f":"+IF(MOD(S$7,'Parametros Evaluacion'!$E71+1)=0,'Detalle evaluacion'!$C44,0)","v":0},{"$f":"+IF(MOD(T$7,'Parametros Evaluacion'!$E71+1)=0,'Detalle evaluacion'!$C44,0)","v":0},{"$f":"+IF(MOD(U$7,'Parametros Evaluacion'!$E71+1)=0,'Detalle evaluacion'!$C44,0)","v":0},{"$f":"+IF(MOD(V$7,'Parametros Evaluacion'!$E71+1)=0,'Detalle evaluacion'!$C44,0)","v":0}]
[null,{"$f":"+'Acciones a Ejecutar'!A43","v":"Optimización hidráulica: sectorización de la red de distribución, control de presión, optimización de la capacidad de almacenamiento."},{"$f":"IF('Acciones a Ejecutar'!B43=\"si\",'Premisas Inversiones'!C43,0)/1000000","v":0},{"$f":"+IF(MOD(D$7,'Parametros Evaluacion'!$E72+1)=0,'Detalle evaluacion'!$C45,0)","v":0},{"$f":"+IF(MOD(E$7,'Parametros Evaluacion'!$E72+1)=0,'Detalle evaluacion'!$C45,0)","v":0},{"$f":"+IF(MOD(F$7,'Parametros Evaluacion'!$E72+1)=0,'Detalle evaluacion'!$C45,0)","v":0},{"$f":"+IF(MOD(G$7,'Parametros Evaluacion'!$E72+1)=0,'Detalle evaluacion'!$C45,0)","v":0},{"$f":"+IF(MOD(H$7,'Parametros Evaluacion'!$E72+1)=0,'Detalle evaluacion'!$C45,0)","v":0},{"$f":"+IF(MOD(I$7,'Parametros Evaluacion'!$E72+1)=0,'Detalle evaluacion'!$C45,0)","v":0},{"$f":"+IF(MOD(J$7,'Parametros Evaluacion'!$E72+1)=0,'Detalle evaluacion'!$C45,0)","v":0},{"$f":"+IF(MOD(K$7,'Parametros Evaluacion'!$E72+1)=0,'Detalle evaluacion'!$C45,0)","v":0},{"$f":"+IF(MOD(L$7,'Parametros Evaluacion'!$E72+1)=0,'Detalle evaluacion'!$C45,0)","v":0},{"$f":"+IF(MOD(M$7,'Parametros Evaluacion'!$E72+1)=0,'Detalle evaluacion'!$C45,0)","v":0},{"$f":"+IF(MOD(N$7,'Parametros Evaluacion'!$E72+1)=0,'Detalle evaluacion'!$C45,0)","v":0},{"$f":"+IF(MOD(O$7,'Parametros Evaluacion'!$E72+1)=0,'Detalle evaluacion'!$C45,0)","v":0},{"$f":"+IF(MOD(P$7,'Parametros Evaluacion'!$E72+1)=0,'Detalle evaluacion'!$C45,0)","v":0},{"$f":"+IF(MOD(Q$7,'Parametros Evaluacion'!$E72+1)=0,'Detalle evaluacion'!$C45,0)","v":0},{"$f":"+IF(MOD(R$7,'Parametros Evaluacion'!$E72+1)=0,'Detalle evaluacion'!$C45,0)","v":0},{"$f":"+IF(MOD(S$7,'Parametros Evaluacion'!$E72+1)=0,'Detalle evaluacion'!$C45,0)","v":0},{"$f":"+IF(MOD(T$7,'Parametros Evaluacion'!$E72+1)=0,'Detalle evaluacion'!$C45,0)","v":0},{"$f":"+IF(MOD(U$7,'Parametros Evaluacion'!$E72+1)=0,'Detalle evaluacion'!$C45,0)","v":0},{"$f":"+IF(MOD(V$7,'Parametros Evaluacion'!$E72+1)=0,'Detalle evaluacion'!$C45,0)","v":0}]
[null,{"$f":"+'Acciones a Ejecutar'!A44","v":"Catastro de infraestructura hidráulica y de redes"},{"$f":"IF('Acciones a Ejecutar'!B44=\"si\",'Premisas Inversiones'!C44,0)/1000000","v":0},{"$f":"+IF(MOD(D$7,'Parametros Evaluacion'!$E73+1)=0,'Detalle evaluacion'!$C46,0)","v":0},{"$f":"+IF(MOD(E$7,'Parametros Evaluacion'!$E73+1)=0,'Detalle evaluacion'!$C46,0)","v":0},{"$f":"+IF(MOD(F$7,'Parametros Evaluacion'!$E73+1)=0,'Detalle evaluacion'!$C46,0)","v":0},{"$f":"+IF(MOD(G$7,'Parametros Evaluacion'!$E73+1)=0,'Detalle evaluacion'!$C46,0)","v":0},{"$f":"+IF(MOD(H$7,'Parametros Evaluacion'!$E73+1)=0,'Detalle evaluacion'!$C46,0)","v":0},{"$f":"+IF(MOD(I$7,'Parametros Evaluacion'!$E73+1)=0,'Detalle evaluacion'!$C46,0)","v":0},{"$f":"+IF(MOD(J$7,'Parametros Evaluacion'!$E73+1)=0,'Detalle evaluacion'!$C46,0)","v":0},{"$f":"+IF(MOD(K$7,'Parametros Evaluacion'!$E73+1)=0,'Detalle evaluacion'!$C46,0)","v":0},{"$f":"+IF(MOD(L$7,'Parametros Evaluacion'!$E73+1)=0,'Detalle evaluacion'!$C46,0)","v":0},{"$f":"+IF(MOD(M$7,'Parametros Evaluacion'!$E73+1)=0,'Detalle evaluacion'!$C46,0)","v":0},{"$f":"+IF(MOD(N$7,'Parametros Evaluacion'!$E73+1)=0,'Detalle evaluacion'!$C46,0)","v":0},{"$f":"+IF(MOD(O$7,'Parametros Evaluacion'!$E73+1)=0,'Detalle evaluacion'!$C46,0)","v":0},{"$f":"+IF(MOD(P$7,'Parametros Evaluacion'!$E73+1)=0,'Detalle evaluacion'!$C46,0)","v":0},{"$f":"+IF(MOD(Q$7,'Parametros Evaluacion'!$E73+1)=0,'Detalle evaluacion'!$C46,0)","v":0},{"$f":"+IF(MOD(R$7,'Parametros Evaluacion'!$E73+1)=0,'Detalle evaluacion'!$C46,0)","v":0},{"$f":"+IF(MOD(S$7,'Parametros Evaluacion'!$E73+1)=0,'Detalle evaluacion'!$C46,0)","v":0},{"$f":"+IF(MOD(T$7,'Parametros Evaluacion'!$E73+1)=0,'Detalle evaluacion'!$C46,0)","v":0},{"$f":"+IF(MOD(U$7,'Parametros Evaluacion'!$E73+1)=0,'Detalle evaluacion'!$C46,0)","v":0},{"$f":"+IF(MOD(V$7,'Parametros Evaluacion'!$E73+1)=0,'Detalle evaluacion'!$C46,0)","v":0}]
[null,{"$f":"+'Acciones a Ejecutar'!A45","v":"Instalación de macromedidores en captaciones"},{"$f":"IF('Acciones a Ejecutar'!B45=\"si\",'Premisas Inversiones'!C45,0)/1000000","v":0},{"$f":"+IF(MOD(D$7,'Parametros Evaluacion'!$E74+1)=0,'Detalle evaluacion'!$C47,0)","v":0},{"$f":"+IF(MOD(E$7,'Parametros Evaluacion'!$E74+1)=0,'Detalle evaluacion'!$C47,0)","v":0},{"$f":"+IF(MOD(F$7,'Parametros Evaluacion'!$E74+1)=0,'Detalle evaluacion'!$C47,0)","v":0},{"$f":"+IF(MOD(G$7,'Parametros Evaluacion'!$E74+1)=0,'Detalle evaluacion'!$C47,0)","v":0},{"$f":"+IF(MOD(H$7,'Parametros Evaluacion'!$E74+1)=0,'Detalle evaluacion'!$C47,0)","v":0},{"$f":"+IF(MOD(I$7,'Parametros Evaluacion'!$E74+1)=0,'Detalle evaluacion'!$C47,0)","v":0},{"$f":"+IF(MOD(J$7,'Parametros Evaluacion'!$E74+1)=0,'Detalle evaluacion'!$C47,0)","v":0},{"$f":"+IF(MOD(K$7,'Parametros Evaluacion'!$E74+1)=0,'Detalle evaluacion'!$C47,0)","v":0},{"$f":"+IF(MOD(L$7,'Parametros Evaluacion'!$E74+1)=0,'Detalle evaluacion'!$C47,0)","v":0},{"$f":"+IF(MOD(M$7,'Parametros Evaluacion'!$E74+1)=0,'Detalle evaluacion'!$C47,0)","v":0},{"$f":"+IF(MOD(N$7,'Parametros Evaluacion'!$E74+1)=0,'Detalle evaluacion'!$C47,0)","v":0},{"$f":"+IF(MOD(O$7,'Parametros Evaluacion'!$E74+1)=0,'Detalle evaluacion'!$C47,0)","v":0},{"$f":"+IF(MOD(P$7,'Parametros Evaluacion'!$E74+1)=0,'Detalle evaluacion'!$C47,0)","v":0},{"$f":"+IF(MOD(Q$7,'Parametros Evaluacion'!$E74+1)=0,'Detalle evaluacion'!$C47,0)","v":0},{"$f":"+IF(MOD(R$7,'Parametros Evaluacion'!$E74+1)=0,'Detalle evaluacion'!$C47,0)","v":0},{"$f":"+IF(MOD(S$7,'Parametros Evaluacion'!$E74+1)=0,'Detalle evaluacion'!$C47,0)","v":0},{"$f":"+IF(MOD(T$7,'Parametros Evaluacion'!$E74+1)=0,'Detalle evaluacion'!$C47,0)","v":0},{"$f":"+IF(MOD(U$7,'Parametros Evaluacion'!$E74+1)=0,'Detalle evaluacion'!$C47,0)","v":0},{"$f":"+IF(MOD(V$7,'Parametros Evaluacion'!$E74+1)=0,'Detalle evaluacion'!$C47,0)","v":0}]
[null,{"$f":"+'Acciones a Ejecutar'!A46","v":"Instalación de macromedidores en sectores"},{"$f":"IF('Acciones a Ejecutar'!B46=\"si\",'Premisas Inversiones'!C46,0)/1000000","v":0},{"$f":"+IF(MOD(D$7,'Parametros Evaluacion'!$E75+1)=0,'Detalle evaluacion'!$C48,0)","v":0},{"$f":"+IF(MOD(E$7,'Parametros Evaluacion'!$E75+1)=0,'Detalle evaluacion'!$C48,0)","v":0},{"$f":"+IF(MOD(F$7,'Parametros Evaluacion'!$E75+1)=0,'Detalle evaluacion'!$C48,0)","v":0},{"$f":"+IF(MOD(G$7,'Parametros Evaluacion'!$E75+1)=0,'Detalle evaluacion'!$C48,0)","v":0},{"$f":"+IF(MOD(H$7,'Parametros Evaluacion'!$E75+1)=0,'Detalle evaluacion'!$C48,0)","v":0},{"$f":"+IF(MOD(I$7,'Parametros Evaluacion'!$E75+1)=0,'Detalle evaluacion'!$C48,0)","v":0},{"$f":"+IF(MOD(J$7,'Parametros Evaluacion'!$E75+1)=0,'Detalle evaluacion'!$C48,0)","v":0},{"$f":"+IF(MOD(K$7,'Parametros Evaluacion'!$E75+1)=0,'Detalle evaluacion'!$C48,0)","v":0},{"$f":"+IF(MOD(L$7,'Parametros Evaluacion'!$E75+1)=0,'Detalle evaluacion'!$C48,0)","v":0},{"$f":"+IF(MOD(M$7,'Parametros Evaluacion'!$E75+1)=0,'Detalle evaluacion'!$C48,0)","v":0},{"$f":"+IF(MOD(N$7,'Parametros Evaluacion'!$E75+1)=0,'Detalle evaluacion'!$C48,0)","v":0},{"$f":"+IF(MOD(O$7,'Parametros Evaluacion'!$E75+1)=0,'Detalle evaluacion'!$C48,0)","v":0},{"$f":"+IF(MOD(P$7,'Parametros Evaluacion'!$E75+1)=0,'Detalle evaluacion'!$C48,0)","v":0},{"$f":"+IF(MOD(Q$7,'Parametros Evaluacion'!$E75+1)=0,'Detalle evaluacion'!$C48,0)","v":0},{"$f":"+IF(MOD(R$7,'Parametros Evaluacion'!$E75+1)=0,'Detalle evaluacion'!$C48,0)","v":0},{"$f":"+IF(MOD(S$7,'Parametros Evaluacion'!$E75+1)=0,'Detalle evaluacion'!$C48,0)","v":0},{"$f":"+IF(MOD(T$7,'Parametros Evaluacion'!$E75+1)=0,'Detalle evaluacion'!$C48,0)","v":0},{"$f":"+IF(MOD(U$7,'Parametros Evaluacion'!$E75+1)=0,'Detalle evaluacion'!$C48,0)","v":0},{"$f":"+IF(MOD(V$7,'Parametros Evaluacion'!$E75+1)=0,'Detalle evaluacion'!$C48,0)","v":0}]
[null,{"$f":"+'Acciones a Ejecutar'!A47","v":"Sistematización de lectura de macromedidores en captaciones y sectores ( p.ej. a través de telemetría)"},{"$f":"IF('Acciones a Ejecutar'!B47=\"si\",'Premisas Inversiones'!C47,0)/1000000","v":0},{"$f":"+IF(MOD(D$7,'Parametros Evaluacion'!$E76+1)=0,'Detalle evaluacion'!$C49,0)","v":0},{"$f":"+IF(MOD(E$7,'Parametros Evaluacion'!$E76+1)=0,'Detalle evaluacion'!$C49,0)","v":0},{"$f":"+IF(MOD(F$7,'Parametros Evaluacion'!$E76+1)=0,'Detalle evaluacion'!$C49,0)","v":0},{"$f":"+IF(MOD(G$7,'Parametros Evaluacion'!$E76+1)=0,'Detalle evaluacion'!$C49,0)","v":0},{"$f":"+IF(MOD(H$7,'Parametros Evaluacion'!$E76+1)=0,'Detalle evaluacion'!$C49,0)","v":0},{"$f":"+IF(MOD(I$7,'Parametros Evaluacion'!$E76+1)=0,'Detalle evaluacion'!$C49,0)","v":0},{"$f":"+IF(MOD(J$7,'Parametros Evaluacion'!$E76+1)=0,'Detalle evaluacion'!$C49,0)","v":0},{"$f":"+IF(MOD(K$7,'Parametros Evaluacion'!$E76+1)=0,'Detalle evaluacion'!$C49,0)","v":0},{"$f":"+IF(MOD(L$7,'Parametros Evaluacion'!$E76+1)=0,'Detalle evaluacion'!$C49,0)","v":0},{"$f":"+IF(MOD(M$7,'Parametros Evaluacion'!$E76+1)=0,'Detalle evaluacion'!$C49,0)","v":0},{"$f":"+IF(MOD(N$7,'Parametros Evaluacion'!$E76+1)=0,'Detalle evaluacion'!$C49,0)","v":0},{"$f":"+IF(MOD(O$7,'Parametros Evaluacion'!$E76+1)=0,'Detalle evaluacion'!$C49,0)","v":0},{"$f":"+IF(MOD(P$7,'Parametros Evaluacion'!$E76+1)=0,'Detalle evaluacion'!$C49,0)","v":0},{"$f":"+IF(MOD(Q$7,'Parametros Evaluacion'!$E76+1)=0,'Detalle evaluacion'!$C49,0)","v":0},{"$f":"+IF(MOD(R$7,'Parametros Evaluacion'!$E76+1)=0,'Detalle evaluacion'!$C49,0)","v":0},{"$f":"+IF(MOD(S$7,'Parametros Evaluacion'!$E76+1)=0,'Detalle evaluacion'!$C49,0)","v":0},{"$f":"+IF(MOD(T$7,'Parametros Evaluacion'!$E76+1)=0,'Detalle evaluacion'!$C49,0)","v":0},{"$f":"+IF(MOD(U$7,'Parametros Evaluacion'!$E76+1)=0,'Detalle evaluacion'!$C49,0)","v":0},{"$f":"+IF(MOD(V$7,'Parametros Evaluacion'!$E76+1)=0,'Detalle evaluacion'!$C49,0)","v":0}]
[null,{"$f":"+'Acciones a Ejecutar'!A48","v":"Sustitución de tuberías con alto índice de fugas"},{"$f":"IF('Acciones a Ejecutar'!B48=\"si\",'Premisas Inversiones'!C48,0)/1000000","v":0},{"$f":"+IF(MOD(D$7,'Parametros Evaluacion'!$E77+1)=0,'Detalle evaluacion'!$C50,0)","v":0},{"$f":"+IF(MOD(E$7,'Parametros Evaluacion'!$E77+1)=0,'Detalle evaluacion'!$C50,0)","v":0},{"$f":"+IF(MOD(F$7,'Parametros Evaluacion'!$E77+1)=0,'Detalle evaluacion'!$C50,0)","v":0},{"$f":"+IF(MOD(G$7,'Parametros Evaluacion'!$E77+1)=0,'Detalle evaluacion'!$C50,0)","v":0},{"$f":"+IF(MOD(H$7,'Parametros Evaluacion'!$E77+1)=0,'Detalle evaluacion'!$C50,0)","v":0},{"$f":"+IF(MOD(I$7,'Parametros Evaluacion'!$E77+1)=0,'Detalle evaluacion'!$C50,0)","v":0},{"$f":"+IF(MOD(J$7,'Parametros Evaluacion'!$E77+1)=0,'Detalle evaluacion'!$C50,0)","v":0},{"$f":"+IF(MOD(K$7,'Parametros Evaluacion'!$E77+1)=0,'Detalle evaluacion'!$C50,0)","v":0},{"$f":"+IF(MOD(L$7,'Parametros Evaluacion'!$E77+1)=0,'Detalle evaluacion'!$C50,0)","v":0},{"$f":"+IF(MOD(M$7,'Parametros Evaluacion'!$E77+1)=0,'Detalle evaluacion'!$C50,0)","v":0},{"$f":"+IF(MOD(N$7,'Parametros Evaluacion'!$E77+1)=0,'Detalle evaluacion'!$C50,0)","v":0},{"$f":"+IF(MOD(O$7,'Parametros Evaluacion'!$E77+1)=0,'Detalle evaluacion'!$C50,0)","v":0},{"$f":"+IF(MOD(P$7,'Parametros Evaluacion'!$E77+1)=0,'Detalle evaluacion'!$C50,0)","v":0},{"$f":"+IF(MOD(Q$7,'Parametros Evaluacion'!$E77+1)=0,'Detalle evaluacion'!$C50,0)","v":0},{"$f":"+IF(MOD(R$7,'Parametros Evaluacion'!$E77+1)=0,'Detalle evaluacion'!$C50,0)","v":0},{"$f":"+IF(MOD(S$7,'Parametros Evaluacion'!$E77+1)=0,'Detalle evaluacion'!$C50,0)","v":0},{"$f":"+IF(MOD(T$7,'Parametros Evaluacion'!$E77+1)=0,'Detalle evaluacion'!$C50,0)","v":0},{"$f":"+IF(MOD(U$7,'Parametros Evaluacion'!$E77+1)=0,'Detalle evaluacion'!$C50,0)","v":0},{"$f":"+IF(MOD(V$7,'Parametros Evaluacion'!$E77+1)=0,'Detalle evaluacion'!$C50,0)","v":0}]
[null,{"$f":"+'Acciones a Ejecutar'!A49","v":"Capacitación del personal del OO en operación de equipos"},{"$f":"IF('Acciones a Ejecutar'!B49=\"si\",'Premisas Inversiones'!C49,0)/1000000","v":0},{"$f":"+IF(MOD(D$7,'Parametros Evaluacion'!$E78+1)=0,'Detalle evaluacion'!$C51,0)","v":0},{"$f":"+IF(MOD(E$7,'Parametros Evaluacion'!$E78+1)=0,'Detalle evaluacion'!$C51,0)","v":0},{"$f":"+IF(MOD(F$7,'Parametros Evaluacion'!$E78+1)=0,'Detalle evaluacion'!$C51,0)","v":0},{"$f":"+IF(MOD(G$7,'Parametros Evaluacion'!$E78+1)=0,'Detalle evaluacion'!$C51,0)","v":0},{"$f":"+IF(MOD(H$7,'Parametros Evaluacion'!$E78+1)=0,'Detalle evaluacion'!$C51,0)","v":0},{"$f":"+IF(MOD(I$7,'Parametros Evaluacion'!$E78+1)=0,'Detalle evaluacion'!$C51,0)","v":0},{"$f":"+IF(MOD(J$7,'Parametros Evaluacion'!$E78+1)=0,'Detalle evaluacion'!$C51,0)","v":0},{"$f":"+IF(MOD(K$7,'Parametros Evaluacion'!$E78+1)=0,'Detalle evaluacion'!$C51,0)","v":0},{"$f":"+IF(MOD(L$7,'Parametros Evaluacion'!$E78+1)=0,'Detalle evaluacion'!$C51,0)","v":0},{"$f":"+IF(MOD(M$7,'Parametros Evaluacion'!$E78+1)=0,'Detalle evaluacion'!$C51,0)","v":0},{"$f":"+IF(MOD(N$7,'Parametros Evaluacion'!$E78+1)=0,'Detalle evaluacion'!$C51,0)","v":0},{"$f":"+IF(MOD(O$7,'Parametros Evaluacion'!$E78+1)=0,'Detalle evaluacion'!$C51,0)","v":0},{"$f":"+IF(MOD(P$7,'Parametros Evaluacion'!$E78+1)=0,'Detalle evaluacion'!$C51,0)","v":0},{"$f":"+IF(MOD(Q$7,'Parametros Evaluacion'!$E78+1)=0,'Detalle evaluacion'!$C51,0)","v":0},{"$f":"+IF(MOD(R$7,'Parametros Evaluacion'!$E78+1)=0,'Detalle evaluacion'!$C51,0)","v":0},{"$f":"+IF(MOD(S$7,'Parametros Evaluacion'!$E78+1)=0,'Detalle evaluacion'!$C51,0)","v":0},{"$f":"+IF(MOD(T$7,'Parametros Evaluacion'!$E78+1)=0,'Detalle evaluacion'!$C51,0)","v":0},{"$f":"+IF(MOD(U$7,'Parametros Evaluacion'!$E78+1)=0,'Detalle evaluacion'!$C51,0)","v":0},{"$f":"+IF(MOD(V$7,'Parametros Evaluacion'!$E78+1)=0,'Detalle evaluacion'!$C51,0)","v":0}]
[null,{"$f":"+'Acciones a Ejecutar'!A50","v":"Sistema de Información Geográfica"},{"$f":"IF('Acciones a Ejecutar'!B50=\"si\",'Premisas Inversiones'!C50,0)/1000000","v":0},{"$f":"+IF(MOD(D$7,'Parametros Evaluacion'!$E79+1)=0,'Detalle evaluacion'!$C52,0)","v":0},{"$f":"+IF(MOD(E$7,'Parametros Evaluacion'!$E79+1)=0,'Detalle evaluacion'!$C52,0)","v":0},{"$f":"+IF(MOD(F$7,'Parametros Evaluacion'!$E79+1)=0,'Detalle evaluacion'!$C52,0)","v":0},{"$f":"+IF(MOD(G$7,'Parametros Evaluacion'!$E79+1)=0,'Detalle evaluacion'!$C52,0)","v":0},{"$f":"+IF(MOD(H$7,'Parametros Evaluacion'!$E79+1)=0,'Detalle evaluacion'!$C52,0)","v":0},{"$f":"+IF(MOD(I$7,'Parametros Evaluacion'!$E79+1)=0,'Detalle evaluacion'!$C52,0)","v":0},{"$f":"+IF(MOD(J$7,'Parametros Evaluacion'!$E79+1)=0,'Detalle evaluacion'!$C52,0)","v":0},{"$f":"+IF(MOD(K$7,'Parametros Evaluacion'!$E79+1)=0,'Detalle evaluacion'!$C52,0)","v":0},{"$f":"+IF(MOD(L$7,'Parametros Evaluacion'!$E79+1)=0,'Detalle evaluacion'!$C52,0)","v":0},{"$f":"+IF(MOD(M$7,'Parametros Evaluacion'!$E79+1)=0,'Detalle evaluacion'!$C52,0)","v":0},{"$f":"+IF(MOD(N$7,'Parametros Evaluacion'!$E79+1)=0,'Detalle evaluacion'!$C52,0)","v":0},{"$f":"+IF(MOD(O$7,'Parametros Evaluacion'!$E79+1)=0,'Detalle evaluacion'!$C52,0)","v":0},{"$f":"+IF(MOD(P$7,'Parametros Evaluacion'!$E79+1)=0,'Detalle evaluacion'!$C52,0)","v":0},{"$f":"+IF(MOD(Q$7,'Parametros Evaluacion'!$E79+1)=0,'Detalle evaluacion'!$C52,0)","v":0},{"$f":"+IF(MOD(R$7,'Parametros Evaluacion'!$E79+1)=0,'Detalle evaluacion'!$C52,0)","v":0},{"$f":"+IF(MOD(S$7,'Parametros Evaluacion'!$E79+1)=0,'Detalle evaluacion'!$C52,0)","v":0},{"$f":"+IF(MOD(T$7,'Parametros Evaluacion'!$E79+1)=0,'Detalle evaluacion'!$C52,0)","v":0},{"$f":"+IF(MOD(U$7,'Parametros Evaluacion'!$E79+1)=0,'Detalle evaluacion'!$C52,0)","v":0},{"$f":"+IF(MOD(V$7,'Parametros Evaluacion'!$E79+1)=0,'Detalle evaluacion'!$C52,0)","v":0}]
[null,"Total PAI de reducciòn de Pérdidas Físicas de Agua",{"$f":"SUM(C41:C52)","v":0},0,0,0,0,0,0,0,0,0,0,0,0,0,0,0,0,0,0,0]
[null,"5. PAI para sostenibilidad a las acciones "]
[null,{"$f":"+'Acciones a Ejecutar'!A53","v":"Establecimiento de un comité ciudadano del organismo operador"},{"$f":"IF('Acciones a Ejecutar'!B53=\"si\",'Premisas Inversiones'!C53,0)/1000000","v":0},{"$f":"+IF(MOD(D$7,'Parametros Evaluacion'!$E82+1)=0,'Detalle evaluacion'!$C55,0)","v":0},{"$f":"+IF(MOD(E$7,'Parametros Evaluacion'!$E82+1)=0,'Detalle evaluacion'!$C55,0)","v":0},{"$f":"+IF(MOD(F$7,'Parametros Evaluacion'!$E82+1)=0,'Detalle evaluacion'!$C55,0)","v":0},{"$f":"+IF(MOD(G$7,'Parametros Evaluacion'!$E82+1)=0,'Detalle evaluacion'!$C55,0)","v":0},{"$f":"+IF(MOD(H$7,'Parametros Evaluacion'!$E82+1)=0,'Detalle evaluacion'!$C55,0)","v":0},{"$f":"+IF(MOD(I$7,'Parametros Evaluacion'!$E82+1)=0,'Detalle evaluacion'!$C55,0)","v":0},{"$f":"+IF(MOD(J$7,'Parametros Evaluacion'!$E82+1)=0,'Detalle evaluacion'!$C55,0)","v":0},{"$f":"+IF(MOD(K$7,'Parametros Evaluacion'!$E82+1)=0,'Detalle evaluacion'!$C55,0)","v":0},{"$f":"+IF(MOD(L$7,'Parametros Evaluacion'!$E82+1)=0,'Detalle evaluacion'!$C55,0)","v":0},{"$f":"+IF(MOD(M$7,'Parametros Evaluacion'!$E82+1)=0,'Detalle evaluacion'!$C55,0)","v":0},{"$f":"+IF(MOD(N$7,'Parametros Evaluacion'!$E82+1)=0,'Detalle evaluacion'!$C55,0)","v":0},{"$f":"+IF(MOD(O$7,'Parametros Evaluacion'!$E82+1)=0,'Detalle evaluacion'!$C55,0)","v":0},{"$f":"+IF(MOD(P$7,'Parametros Evaluacion'!$E82+1)=0,'Detalle evaluacion'!$C55,0)","v":0},{"$f":"+IF(MOD(Q$7,'Parametros Evaluacion'!$E82+1)=0,'Detalle evaluacion'!$C55,0)","v":0},{"$f":"+IF(MOD(R$7,'Parametros Evaluacion'!$E82+1)=0,'Detalle evaluacion'!$C55,0)","v":0},{"$f":"+IF(MOD(S$7,'Parametros Evaluacion'!$E82+1)=0,'Detalle evaluacion'!$C55,0)","v":0},{"$f":"+IF(MOD(T$7,'Parametros Evaluacion'!$E82+1)=0,'Detalle evaluacion'!$C55,0)","v":0},{"$f":"+IF(MOD(U$7,'Parametros Evaluacion'!$E82+1)=0,'Detalle evaluacion'!$C55,0)","v":0},{"$f":"+IF(MOD(V$7,'Parametros Evaluacion'!$E82+1)=0,'Detalle evaluacion'!$C55,0)","v":0}]
[null,{"$f":"+'Acciones a Ejecutar'!A54","v":"Elaboración de un código de ética y suscripción por parte del personal del OO"},{"$f":"IF('Acciones a Ejecutar'!B54=\"si\",'Premisas Inversiones'!C54,0)/1000000","v":0},{"$f":"+IF(MOD(D$7,'Parametros Evaluacion'!$E83+1)=0,'Detalle evaluacion'!$C56,0)","v":0},{"$f":"+IF(MOD(E$7,'Parametros Evaluacion'!$E83+1)=0,'Detalle evaluacion'!$C56,0)","v":0},{"$f":"+IF(MOD(F$7,'Parametros Evaluacion'!$E83+1)=0,'Detalle evaluacion'!$C56,0)","v":0},{"$f":"+IF(MOD(G$7,'Parametros Evaluacion'!$E83+1)=0,'Detalle evaluacion'!$C56,0)","v":0},{"$f":"+IF(MOD(H$7,'Parametros Evaluacion'!$E83+1)=0,'Detalle evaluacion'!$C56,0)","v":0},{"$f":"+IF(MOD(I$7,'Parametros Evaluacion'!$E83+1)=0,'Detalle evaluacion'!$C56,0)","v":0},{"$f":"+IF(MOD(J$7,'Parametros Evaluacion'!$E83+1)=0,'Detalle evaluacion'!$C56,0)","v":0},{"$f":"+IF(MOD(K$7,'Parametros Evaluacion'!$E83+1)=0,'Detalle evaluacion'!$C56,0)","v":0},{"$f":"+IF(MOD(L$7,'Parametros Evaluacion'!$E83+1)=0,'Detalle evaluacion'!$C56,0)","v":0},{"$f":"+IF(MOD(M$7,'Parametros Evaluacion'!$E83+1)=0,'Detalle evaluacion'!$C56,0)","v":0},{"$f":"+IF(MOD(N$7,'Parametros Evaluacion'!$E83+1)=0,'Detalle evaluacion'!$C56,0)","v":0},{"$f":"+IF(MOD(O$7,'Parametros Evaluacion'!$E83+1)=0,'Detalle evaluacion'!$C56,0)","v":0},{"$f":"+IF(MOD(P$7,'Parametros Evaluacion'!$E83+1)=0,'Detalle evaluacion'!$C56,0)","v":0},{"$f":"+IF(MOD(Q$7,'Parametros Evaluacion'!$E83+1)=0,'Detalle evaluacion'!$C56,0)","v":0},{"$f":"+IF(MOD(R$7,'Parametros Evaluacion'!$E83+1)=0,'Detalle evaluacion'!$C56,0)","v":0},{"$f":"+IF(MOD(S$7,'Parametros Evaluacion'!$E83+1)=0,'Detalle evaluacion'!$C56,0)","v":0},{"$f":"+IF(MOD(T$7,'Parametros Evaluacion'!$E83+1)=0,'Detalle evaluacion'!$C56,0)","v":0},{"$f":"+IF(MOD(U$7,'Parametros Evaluacion'!$E83+1)=0,'Detalle evaluacion'!$C56,0)","v":0},{"$f":"+IF(MOD(V$7,'Parametros Evaluacion'!$E83+1)=0,'Detalle evaluacion'!$C56,0)","v":0}]
[null,{"$f":"+'Acciones a Ejecutar'!A55","v":"Sistema informático de contabilidad"},{"$f":"IF('Acciones a Ejecutar'!B55=\"si\",'Premisas Inversiones'!C55,0)/1000000","v":0},{"$f":"+IF(MOD(D$7,'Parametros Evaluacion'!$E84+1)=0,'Detalle evaluacion'!$C57,0)","v":0},{"$f":"+IF(MOD(E$7,'Parametros Evaluacion'!$E84+1)=0,'Detalle evaluacion'!$C57,0)","v":0},{"$f":"+IF(MOD(F$7,'Parametros Evaluacion'!$E84+1)=0,'Detalle evaluacion'!$C57,0)","v":0},{"$f":"+IF(MOD(G$7,'Parametros Evaluacion'!$E84+1)=0,'Detalle evaluacion'!$C57,0)","v":0},{"$f":"+IF(MOD(H$7,'Parametros Evaluacion'!$E84+1)=0,'Detalle evaluacion'!$C57,0)","v":0},{"$f":"+IF(MOD(I$7,'Parametros Evaluacion'!$E84+1)=0,'Detalle evaluacion'!$C57,0)","v":0},{"$f":"+IF(MOD(J$7,'Parametros Evaluacion'!$E84+1)=0,'Detalle evaluacion'!$C57,0)","v":0},{"$f":"+IF(MOD(K$7,'Parametros Evaluacion'!$E84+1)=0,'Detalle evaluacion'!$C57,0)","v":0},{"$f":"+IF(MOD(L$7,'Parametros Evaluacion'!$E84+1)=0,'Detalle evaluacion'!$C57,0)","v":0},{"$f":"+IF(MOD(M$7,'Parametros Evaluacion'!$E84+1)=0,'Detalle evaluacion'!$C57,0)","v":0},{"$f":"+IF(MOD(N$7,'Parametros Evaluacion'!$E84+1)=0,'Detalle evaluacion'!$C57,0)","v":0},{"$f":"+IF(MOD(O$7,'Parametros Evaluacion'!$E84+1)=0,'Detalle evaluacion'!$C57,0)","v":0},{"$f":"+IF(MOD(P$7,'Parametros Evaluacion'!$E84+1)=0,'Detalle evaluacion'!$C57,0)","v":0},{"$f":"+IF(MOD(Q$7,'Parametros Evaluacion'!$E84+1)=0,'Detalle evaluacion'!$C57,0)","v":0},{"$f":"+IF(MOD(R$7,'Parametros Evaluacion'!$E84+1)=0,'Detalle evaluacion'!$C57,0)","v":0},{"$f":"+IF(MOD(S$7,'Parametros Evaluacion'!$E84+1)=0,'Detalle evaluacion'!$C57,0)","v":0},{"$f":"+IF(MOD(T$7,'Parametros Evaluacion'!$E84+1)=0,'Detalle evaluacion'!$C57,0)","v":0},{"$f":"+IF(MOD(U$7,'Parametros Evaluacion'!$E84+1)=0,'Detalle evaluacion'!$C57,0)","v":0},{"$f":"+IF(MOD(V$7,'Parametros Evaluacion'!$E84+1)=0,'Detalle evaluacion'!$C57,0)","v":0}]
[null,{"$f":"+'Acciones a Ejecutar'!A56","v":"Sistema de planeación Integral"},{"$f":"IF('Acciones a Ejecutar'!B56=\"si\",'Premisas Inversiones'!C56,0)/1000000","v":0},{"$f":"+IF(MOD(D$7,'Parametros Evaluacion'!$E85+1)=0,'Detalle evaluacion'!$C58,0)","v":0},{"$f":"+IF(MOD(E$7,'Parametros Evaluacion'!$E85+1)=0,'Detalle evaluacion'!$C58,0)","v":0},{"$f":"+IF(MOD(F$7,'Parametros Evaluacion'!$E85+1)=0,'Detalle evaluacion'!$C58,0)","v":0},{"$f":"+IF(MOD(G$7,'Parametros Evaluacion'!$E85+1)=0,'Detalle evaluacion'!$C58,0)","v":0},{"$f":"+IF(MOD(H$7,'Parametros Evaluacion'!$E85+1)=0,'Detalle evaluacion'!$C58,0)","v":0},{"$f":"+IF(MOD(I$7,'Parametros Evaluacion'!$E85+1)=0,'Detalle evaluacion'!$C58,0)","v":0},{"$f":"+IF(MOD(J$7,'Parametros Evaluacion'!$E85+1)=0,'Detalle evaluacion'!$C58,0)","v":0},{"$f":"+IF(MOD(K$7,'Parametros Evaluacion'!$E85+1)=0,'Detalle evaluacion'!$C58,0)","v":0},{"$f":"+IF(MOD(L$7,'Parametros Evaluacion'!$E85+1)=0,'Detalle evaluacion'!$C58,0)","v":0},{"$f":"+IF(MOD(M$7,'Parametros Evaluacion'!$E85+1)=0,'Detalle evaluacion'!$C58,0)","v":0},{"$f":"+IF(MOD(N$7,'Parametros Evaluacion'!$E85+1)=0,'Detalle evaluacion'!$C58,0)","v":0},{"$f":"+IF(MOD(O$7,'Parametros Evaluacion'!$E85+1)=0,'Detalle evaluacion'!$C58,0)","v":0},{"$f":"+IF(MOD(P$7,'Parametros Evaluacion'!$E85+1)=0,'Detalle evaluacion'!$C58,0)","v":0},{"$f":"+IF(MOD(Q$7,'Parametros Evaluacion'!$E85+1)=0,'Detalle evaluacion'!$C58,0)","v":0},{"$f":"+IF(MOD(R$7,'Parametros Evaluacion'!$E85+1)=0,'Detalle evaluacion'!$C58,0)","v":0},{"$f":"+IF(MOD(S$7,'Parametros Evaluacion'!$E85+1)=0,'Detalle evaluacion'!$C58,0)","v":0},{"$f":"+IF(MOD(T$7,'Parametros Evaluacion'!$E85+1)=0,'Detalle evaluacion'!$C58,0)","v":0},{"$f":"+IF(MOD(U$7,'Parametros Evaluacion'!$E85+1)=0,'Detalle evaluacion'!$C58,0)","v":0},{"$f":"+IF(MOD(V$7,'Parametros Evaluacion'!$E85+1)=0,'Detalle evaluacion'!$C58,0)","v":0}]
[null,{"$f":"+'Acciones a Ejecutar'!A57","v":"Asesoría para financiamiento de contraparte"},{"$f":"IF('Acciones a Ejecutar'!B57=\"si\",'Premisas Inversiones'!C57,0)/1000000","v":0},{"$f":"+IF(MOD(D$7,'Parametros Evaluacion'!$E86+1)=0,'Detalle evaluacion'!$C59,0)","v":0},{"$f":"+IF(MOD(E$7,'Parametros Evaluacion'!$E86+1)=0,'Detalle evaluacion'!$C59,0)","v":0},{"$f":"+IF(MOD(F$7,'Parametros Evaluacion'!$E86+1)=0,'Detalle evaluacion'!$C59,0)","v":0},{"$f":"+IF(MOD(G$7,'Parametros Evaluacion'!$E86+1)=0,'Detalle evaluacion'!$C59,0)","v":0},{"$f":"+IF(MOD(H$7,'Parametros Evaluacion'!$E86+1)=0,'Detalle evaluacion'!$C59,0)","v":0},{"$f":"+IF(MOD(I$7,'Parametros Evaluacion'!$E86+1)=0,'Detalle evaluacion'!$C59,0)","v":0},{"$f":"+IF(MOD(J$7,'Parametros Evaluacion'!$E86+1)=0,'Detalle evaluacion'!$C59,0)","v":0},{"$f":"+IF(MOD(K$7,'Parametros Evaluacion'!$E86+1)=0,'Detalle evaluacion'!$C59,0)","v":0},{"$f":"+IF(MOD(L$7,'Parametros Evaluacion'!$E86+1)=0,'Detalle evaluacion'!$C59,0)","v":0},{"$f":"+IF(MOD(M$7,'Parametros Evaluacion'!$E86+1)=0,'Detalle evaluacion'!$C59,0)","v":0},{"$f":"+IF(MOD(N$7,'Parametros Evaluacion'!$E86+1)=0,'Detalle evaluacion'!$C59,0)","v":0},{"$f":"+IF(MOD(O$7,'Parametros Evaluacion'!$E86+1)=0,'Detalle evaluacion'!$C59,0)","v":0},{"$f":"+IF(MOD(P$7,'Parametros Evaluacion'!$E86+1)=0,'Detalle evaluacion'!$C59,0)","v":0},{"$f":"+IF(MOD(Q$7,'Parametros Evaluacion'!$E86+1)=0,'Detalle evaluacion'!$C59,0)","v":0},{"$f":"+IF(MOD(R$7,'Parametros Evaluacion'!$E86+1)=0,'Detalle evaluacion'!$C59,0)","v":0},{"$f":"+IF(MOD(S$7,'Parametros Evaluacion'!$E86+1)=0,'Detalle evaluacion'!$C59,0)","v":0},{"$f":"+IF(MOD(T$7,'Parametros Evaluacion'!$E86+1)=0,'Detalle evaluacion'!$C59,0)","v":0},{"$f":"+IF(MOD(U$7,'Parametros Evaluacion'!$E86+1)=0,'Detalle evaluacion'!$C59,0)","v":0},{"$f":"+IF(MOD(V$7,'Parametros Evaluacion'!$E86+1)=0,'Detalle evaluacion'!$C59,0)","v":0}]
[null,"Total PAI para sostenibilidad a las acciones",{"$f":"+SUM(C55:C59)","v":0},0,0,0,0,0,0,0,0,0,0,0,0,0,0,0,0,0,0,0]
[null,"Total PAIs",{"$f":"C60+C53+C39+C23+C18","v":0},0,0,0,0,0,0,0,0,0,0,0,0,0,0,0,0,0,0,0]
[]
[null,null,1,{"$f":"+C63+1","v":2},3,4,5,6,7,8,9,10,11,12,13,14,15,16,17,18,19,20]
[null,"Gastos Operacionales PAI  (Millones de pesos)",{"$f":"+C8","v":1},{"$f":"+C64+1","v":2},3,4,5,6,7,8,9,10,11,12,13,14,15,16,17,18,19,20,null,{"$f":"+C64","v":1},{"$f":"+D64","v":2},{"$f":"+E64","v":3},{"$f":"+F64","v":4},{"$f":"+G64","v":5}]
[null,"1. PAI para reducir gastos de energía eléctrica"]
[null,{"$f":"+B10","v":"Solicitud de cambio de tarifa eléctrica para reducir gasto por concepto de energía eléctrica."},{"$f":"IF('Acciones a Ejecutar'!B8=\"si\",'Premisas OPEX'!C8,0)/1000000","v":0},{"$f":"+C66","v":0},0,0,0,0,0,0,0,0,0,0,0,0,0,0,0,0,0,0,null,{"$f":"+C66*Evaluacion!O9","v":0},{"$f":"+D66*Evaluacion!P9+X66","v":0},{"$f":"+E66*Evaluacion!Q9+Y66","v":0},{"$f":"+F66*Evaluacion!R9+Z66","v":0},{"$f":"+G66*Evaluacion!S9+AA66","v":0}]
[null,"Reducción de la potencia reactiva (reducción del factor de potencia)",{"$f":"IF('Acciones a Ejecutar'!B9=\"si\",'Premisas OPEX'!C9,0)/1000000","v":0},{"$f":"+C67","v":0},0,0,0,0,0,0,0,0,0,0,0,0,0,0,0,0,0,0,null,{"$f":"+C67*Evaluacion!O10","v":0},{"$f":"+D67*Evaluacion!P10+X67","v":0},{"$f":"+E67*Evaluacion!Q10+Y67","v":0},{"$f":"+F67*Evaluacion!R10+Z67","v":0},{"$f":"+G67*Evaluacion!S10+AA67","v":0}]
[null,"Sustitución de equipos de bombeo de agua potable para reducir consumo de energía",{"$f":"IF('Acciones a Ejecutar'!B10=\"si\",'Premisas OPEX'!C10,0)/1000000","v":0},{"$f":"+C68","v":0},0,0,0,0,0,0,0,0,0,0,0,0,0,0,0,0,0,0,null,{"$f":"+C68*Evaluacion!O11","v":0},{"$f":"+D68*Evaluacion!P11+X68","v":0},{"$f":"+E68*Evaluacion!Q11+Y68","v":0},{"$f":"+F68*Evaluacion!R11+Z68","v":0},{"$f":"+G68*Evaluacion!S11+AA68","v":0}]
[null,"Sustitución o construcción de tanques de almacenamiento de agua para modificar políticas de operación del equipo de bombeo",{"$f":"IF('Acciones a Ejecutar'!B11=\"si\",'Premisas OPEX'!C11,0)/1000000","v":0},{"$f":"+C69","v":0},0,0,0,0,0,0,0,0,0,0,0,0,0,0,0,0,0,0,null,{"$f":"+C69*Evaluacion!O12","v":0},{"$f":"+D69*Evaluacion!P12+X69","v":0},{"$f":"+E69*Evaluacion!Q12+Y69","v":0},{"$f":"+F69*Evaluacion!R12+Z69","v":0},{"$f":"+G69*Evaluacion!S12+AA69","v":0}]
[null,"Automatización de equipos de bombeo para modificar políticas de operación",{"$f":"IF('Acciones a Ejecutar'!B12=\"si\",'Premisas OPEX'!C12,0)/1000000","v":0},{"$f":"+C70","v":0},0,0,0,0,0,0,0,0,0,0,0,0,0,0,0,0,0,0,null,{"$f":"+C70*Evaluacion!O13","v":0},{"$f":"+D70*Evaluacion!P13+X70","v":0},{"$f":"+E70*Evaluacion!Q13+Y70","v":0},{"$f":"+F70*Evaluacion!R13+Z70","v":0},{"$f":"+G70*Evaluacion!S13+AA70","v":0}]
[null,"Sustitución de bombas de alcantarillado",{"$f":"IF('Acciones a Ejecutar'!B13=\"si\",'Premisas OPEX'!C13,0)/1000000","v":0},{"$f":"+C71","v":0},0,0,0,0,0,0,0,0,0,0,0,0,0,0,0,0,0,0,null,{"$f":"+C71*Evaluacion!O14","v":0},{"$f":"+D71*Evaluacion!P14+X71","v":0},{"$f":"+E71*Evaluacion!Q14+Y71","v":0},{"$f":"+F71*Evaluacion!R14+Z71","v":0},{"$f":"+G71*Evaluacion!S14+AA71","v":0}]
[null,"Reducción de gastos de energía en plantas de tratamiento de aguas residuales (PTAR)",{"$f":"IF('Acciones a Ejecutar'!B14=\"si\",'Premisas OPEX'!C14,0)/1000000","v":0},{"$f":"+C72","v":0},0,0,0,0,0,0,0,0,0,0,0,0,0,0,0,0,0,0,null,{"$f":"+C72*Evaluacion!O15","v":0},{"$f":"+D72*Evaluacion!P15+X72","v":0},{"$f":"+E72*Evaluacion!Q15+Y72","v":0},{"$f":"+F72*Evaluacion!R15+Z72","v":0},{"$f":"+G72*Evaluacion!S15+AA72","v":0}]
[null,"Elaboración de una auditoría energética",{"$f":"IF('Acciones a Ejecutar'!B15=\"si\",'Premisas OPEX'!C15,0)/1000000","v":0},{"$f":"+C73","v":0},0,0,0,0,0,0,0,0,0,0,0,0,0,0,0,0,0,0,null,{"$f":"+C73*Evaluacion!O16","v":0},{"$f":"+D73*Evaluacion!P16+X73","v":0},{"$f":"+E73*Evaluacion!Q16+Y73","v":0},{"$f":"+F73*Evaluacion!R16+Z73","v":0},{"$f":"+G73*Evaluacion!S16+AA73","v":0}]
[null,"Total Inversión PAI para reducción de gastos de energía eléctrica",{"$f":"+SUM(C66:C73)","v":0},0,0,0,0,0,0,0,0,0,0,0,0,0,0,0,0,0,0,0,null,0,0,0,0,0]
[null,"2. PAI para incrementar la productividad del personal "]
[null,{"$f":"+B20","v":"Programa de capacitación y profesionalización para incrementar la productividad del personal."},{"$f":"IF('Acciones a Ejecutar'!B18=\"si\",'Premisas OPEX'!C18,0)/1000000","v":0},{"$f":"+C76","v":0},0,0,0,0,0,0,0,0,0,0,0,0,0,0,0,0,0,0,null,{"$f":"+C76*Evaluacion!O19","v":0},{"$f":"+D76*Evaluacion!P19+X76","v":0},{"$f":"+E76*Evaluacion!Q19+Y76","v":0},{"$f":"+F76*Evaluacion!R19+Z76","v":0},{"$f":"+G76*Evaluacion!S19+AA76","v":0}]
[null,{"$f":"+B21","v":"Revisión del manual de funciones y cargos del personal del OO"},{"$f":"IF('Acciones a Ejecutar'!B19=\"si\",'Premisas OPEX'!C19,0)/1000000","v":0},{"$f":"+C77","v":0},0,0,0,0,0,0,0,0,0,0,0,0,0,0,0,0,0,0,null,{"$f":"+C77*Evaluacion!O20","v":0},{"$f":"+D77*Evaluacion!P20+X77","v":0},{"$f":"+E77*Evaluacion!Q20+Y77","v":0},{"$f":"+F77*Evaluacion!R20+Z77","v":0},{"$f":"+G77*Evaluacion!S20+AA77","v":0}]
[null,{"$f":"+B22","v":"Establecimiento de un programa de retiro voluntario y obligado"},{"$f":"IF('Acciones a Ejecutar'!B20=\"si\",'Premisas OPEX'!C20,0)/1000000","v":0},{"$f":"+C78","v":0},0,0,0,0,0,0,0,0,0,0,0,0,0,0,0,0,0,0,null,{"$f":"+C78*Evaluacion!O21","v":0},{"$f":"+D78*Evaluacion!P21+X78","v":0},{"$f":"+E78*Evaluacion!Q21+Y78","v":0},{"$f":"+F78*Evaluacion!R21+Z78","v":0},{"$f":"+G78*Evaluacion!S21+AA78","v":0}]
[null,"Total Inversión PAI para incrementar la productividad del personal",{"$f":"SUM(C76:C78)","v":0},0,0,0,0,0,0,0,0,0,0,0,0,0,0,0,0,0,0,0,null,0,0,0,0,0]
[null,"3. PAI para mejora de la Gestión Comercial"]
[null,{"$f":"+B25","v":"Ajuste de consumos de cuota fija"},{"$f":"IF('Acciones a Ejecutar'!B23=\"si\",'Premisas OPEX'!C23,0)/1000000","v":0},{"$f":"+C81","v":0},0,0,0,0,0,0,0,0,0,0,0,0,0,0,0,0,0,0,null,{"$f":"+C81*Evaluacion!O24","v":0},{"$f":"+D81*Evaluacion!P24+X81","v":0},{"$f":"+E81*Evaluacion!Q24+Y81","v":0},{"$f":"+F81*Evaluacion!R24+Z81","v":0},{"$f":"+G81*Evaluacion!S24+AA81","v":0}]
[null,"Corrección de errores de micromedición mediante sustitución de medidores.",{"$f":"IF('Acciones a Ejecutar'!B24=\"si\",'Premisas OPEX'!C24,0)/1000000","v":0},{"$f":"+C82","v":0},0,0,0,0,0,0,0,0,0,0,0,0,0,0,0,0,0,0,null,{"$f":"+C82*Evaluacion!O25","v":0},{"$f":"+D82*Evaluacion!P25+X82","v":0},{"$f":"+E82*Evaluacion!Q25+Y82","v":0},{"$f":"+F82*Evaluacion!R25+Z82","v":0},{"$f":"+G82*Evaluacion!S25+AA82","v":0}]
[null,"Impartición de cursos de formación de recursos humanos en eficiencia comercial",{"$f":"IF('Acciones a Ejecutar'!B25=\"si\",'Premisas OPEX'!C25,0)/1000000","v":0},{"$f":"+C83","v":0},0,0,0,0,0,0,0,0,0,0,0,0,0,0,0,0,0,0,null,{"$f":"+C83*Evaluacion!O26","v":0},{"$f":"+D83*Evaluacion!P26+X83","v":0},{"$f":"+E83*Evaluacion!Q26+Y83","v":0},{"$f":"+F83*Evaluacion!R26+Z83","v":0},{"$f":"+G83*Evaluacion!S26+AA83","v":0}]
[null,"Impartición de cursos de formación de recursos humanos en atención a usuarios",{"$f":"IF('Acciones a Ejecutar'!B26=\"si\",'Premisas OPEX'!C26,0)/1000000","v":0},{"$f":"+C84","v":0},0,0,0,0,0,0,0,0,0,0,0,0,0,0,0,0,0,0,null,{"$f":"+C84*Evaluacion!O27","v":0},{"$f":"+D84*Evaluacion!P27+X84","v":0},{"$f":"+E84*Evaluacion!Q27+Y84","v":0},{"$f":"+F84*Evaluacion!R27+Z84","v":0},{"$f":"+G84*Evaluacion!S27+AA84","v":0}]
[null,"Firma de convenios con bancos y otras instituciones para ampliar las opciones de pago de los servicios de agua y saneamiento",{"$f":"IF('Acciones a Ejecutar'!B27=\"si\",'Premisas OPEX'!C27,0)/1000000","v":0},{"$f":"+C85","v":0},0,0,0,0,0,0,0,0,0,0,0,0,0,0,0,0,0,0,null,{"$f":"+C85*Evaluacion!O28","v":0},{"$f":"+D85*Evaluacion!P28+X85","v":0},{"$f":"+E85*Evaluacion!Q28+Y85","v":0},{"$f":"+F85*Evaluacion!R28+Z85","v":0},{"$f":"+G85*Evaluacion!S28+AA85","v":0}]
[null,"Mejoras a la facturación mediante un nuevo sistema comercial",{"$f":"IF('Acciones a Ejecutar'!B28=\"si\",'Premisas OPEX'!C28,0)/1000000","v":0},{"$f":"+C86","v":0},0,0,0,0,0,0,0,0,0,0,0,0,0,0,0,0,0,0,null,{"$f":"+C86*Evaluacion!O29","v":0},{"$f":"+D86*Evaluacion!P29+X86","v":0},{"$f":"+E86*Evaluacion!Q29+Y86","v":0},{"$f":"+F86*Evaluacion!R29+Z86","v":0},{"$f":"+G86*Evaluacion!S29+AA86","v":0}]
[null,"Mejoras en la cobranza mediante esquemas que faciliten el pago.",{"$f":"IF('Acciones a Ejecutar'!B29=\"si\",'Premisas OPEX'!C29,0)/1000000","v":0},{"$f":"+C87","v":0},0,0,0,0,0,0,0,0,0,0,0,0,0,0,0,0,0,0,null,{"$f":"+C87*Evaluacion!O30","v":0},{"$f":"+D87*Evaluacion!P30+X87","v":0},{"$f":"+E87*Evaluacion!Q30+Y87","v":0},{"$f":"+F87*Evaluacion!R30+Z87","v":0},{"$f":"+G87*Evaluacion!S30+AA87","v":0}]
[null,"Localización y regularización de tomas clandestinas",{"$f":"IF('Acciones a Ejecutar'!B30=\"si\",'Premisas OPEX'!C30,0)/1000000","v":0},{"$f":"+C88","v":0},0,0,0,0,0,0,0,0,0,0,0,0,0,0,0,0,0,0,null,{"$f":"+C88*Evaluacion!O31","v":0},{"$f":"+D88*Evaluacion!P31+X88","v":0},{"$f":"+E88*Evaluacion!Q31+Y88","v":0},{"$f":"+F88*Evaluacion!R31+Z88","v":0},{"$f":"+G88*Evaluacion!S31+AA88","v":0}]
[null,"Censo de usuarios para mejorar el padrón. Establecimiento de esquemas de actualización continua del padrón.",{"$f":"IF('Acciones a Ejecutar'!B31=\"si\",'Premisas OPEX'!C31,0)/1000000","v":0},{"$f":"+C89*'Proyecciones Base'!E10","v":0},{"$f":"+D89*'Proyecciones Base'!F10","v":0},{"$f":"+E89*'Proyecciones Base'!G10","v":0},{"$f":"+F89*'Proyecciones Base'!H10","v":0},{"$f":"+G89*'Proyecciones Base'!I10","v":0},{"$f":"+H89*'Proyecciones Base'!J10","v":0},{"$f":"+I89*'Proyecciones Base'!K10","v":0},{"$f":"+J89*'Proyecciones Base'!L10","v":0},{"$f":"+K89*'Proyecciones Base'!M10","v":0},{"$f":"+L89*'Proyecciones Base'!N10","v":0},{"$f":"+M89*'Proyecciones Base'!O10","v":0},{"$f":"+N89*'Proyecciones Base'!P10","v":0},{"$f":"+O89*'Proyecciones Base'!Q10","v":0},{"$f":"+P89*'Proyecciones Base'!R10","v":0},{"$f":"+Q89*'Proyecciones Base'!S10","v":0},{"$f":"+R89*'Proyecciones Base'!T10","v":0},{"$f":"+S89*'Proyecciones Base'!U10","v":0},{"$f":"+T89*'Proyecciones Base'!V10","v":0},{"$f":"+U89*'Proyecciones Base'!W10","v":0},null,{"$f":"+C89*Evaluacion!O32","v":0},{"$f":"+D89*Evaluacion!P32+X89","v":0},{"$f":"+E89*Evaluacion!Q32+Y89","v":0},{"$f":"+F89*Evaluacion!R32+Z89","v":0},{"$f":"+G89*Evaluacion!S32+AA89","v":0}]
[null,"Sistema de cómputo para altas y bajas del padrón de usuarios.",{"$f":"IF('Acciones a Ejecutar'!B32=\"si\",'Premisas OPEX'!C32,0)/1000000","v":0},{"$f":"+C90","v":0},0,0,0,0,0,0,0,0,0,0,0,0,0,0,0,0,0,0,null,{"$f":"+C90*Evaluacion!O33","v":0},{"$f":"+D90*Evaluacion!P33+X90","v":0},{"$f":"+E90*Evaluacion!Q33+Y90","v":0},{"$f":"+F90*Evaluacion!R33+Z90","v":0},{"$f":"+G90*Evaluacion!S33+AA90","v":0}]
[null,"Estudio tarifario con el fin de realizar la actualización de las tarifas de agua",{"$f":"IF('Acciones a Ejecutar'!B33=\"si\",'Premisas OPEX'!C33,0)/1000000","v":0},{"$f":"+C91","v":0},0,0,0,0,0,0,0,0,0,0,0,0,0,0,0,0,0,0,null,{"$f":"+C91*Evaluacion!O34","v":0},{"$f":"+D91*Evaluacion!P34+X91","v":0},{"$f":"+E91*Evaluacion!Q34+Y91","v":0},{"$f":"+F91*Evaluacion!R34+Z91","v":0},{"$f":"+G91*Evaluacion!S34+AA91","v":0}]
[null,"Modificaciones a la estructura tarifaria",{"$f":"IF('Acciones a Ejecutar'!B34=\"si\",'Premisas OPEX'!C34,0)/1000000","v":0},{"$f":"+C92","v":0},0,0,0,0,0,0,0,0,0,0,0,0,0,0,0,0,0,0,null,{"$f":"+C92*Evaluacion!O35","v":0},{"$f":"+D92*Evaluacion!P35+X92","v":0},{"$f":"+E92*Evaluacion!Q35+Y92","v":0},{"$f":"+F92*Evaluacion!R35+Z92","v":0},{"$f":"+G92*Evaluacion!S35+AA92","v":0}]
[null,"Reformas para lograr que las tarifas se actualicen de manera continua",{"$f":"IF('Acciones a Ejecutar'!B35=\"si\",'Premisas OPEX'!C35,0)/1000000","v":0},{"$f":"+C93","v":0},0,0,0,0,0,0,0,0,0,0,0,0,0,0,0,0,0,0,null,{"$f":"+C93*Evaluacion!O36","v":0},{"$f":"+D93*Evaluacion!P36+X93","v":0},{"$f":"+E93*Evaluacion!Q36+Y93","v":0},{"$f":"+F93*Evaluacion!R36+Z93","v":0},{"$f":"+G93*Evaluacion!S36+AA93","v":0}]
[null,"Reformas al marco legal para que el OO pueda establecer tarifas adecuadas",{"$f":"IF('Acciones a Ejecutar'!B36=\"si\",'Premisas OPEX'!C36,0)/1000000","v":0},{"$f":"+C94","v":0},0,0,0,0,0,0,0,0,0,0,0,0,0,0,0,0,0,0,null,{"$f":"+C94*Evaluacion!O37","v":0},{"$f":"+D94*Evaluacion!P37+X94","v":0},{"$f":"+E94*Evaluacion!Q37+Y94","v":0},{"$f":"+F94*Evaluacion!R37+Z94","v":0},{"$f":"+G94*Evaluacion!S37+AA94","v":0}]
[null,"Total PAI para mejora de la Gestión Comercial",{"$f":"SUM(C81:C94)","v":0},0,0,0,0,0,0,0,0,0,0,0,0,0,0,0,0,0,0,0,null,0,0,0,0,0]
[null,"4. PAI para reducción de Pérdidas Físicas de Agua"]
[null,{"$f":"+B41","v":"Localización y reparación de fugas en tanques"},{"$f":"IF('Acciones a Ejecutar'!B39=\"si\",'Premisas OPEX'!C39,0)/1000000","v":0},{"$f":"+C97","v":0},0,0,0,0,0,0,0,0,0,0,0,0,0,0,0,0,0,0,null,{"$f":"+C97*Evaluacion!O40","v":0},{"$f":"+D97*Evaluacion!P40+X97","v":0},{"$f":"+E97*Evaluacion!Q40+Y97","v":0},{"$f":"+F97*Evaluacion!R40+Z97","v":0},{"$f":"+G97*Evaluacion!S40+AA97","v":0}]
[null,"Localización y reparación de fugas en tuberías principales y secundarias",{"$f":"IF('Acciones a Ejecutar'!B40=\"si\",'Premisas OPEX'!C40,0)/1000000","v":0},{"$f":"+C98","v":0},0,0,0,0,0,0,0,0,0,0,0,0,0,0,0,0,0,0,null,{"$f":"+C98*Evaluacion!O41","v":0},{"$f":"+D98*Evaluacion!P41+X98","v":0},{"$f":"+E98*Evaluacion!Q41+Y98","v":0},{"$f":"+F98*Evaluacion!R41+Z98","v":0},{"$f":"+G98*Evaluacion!S41+AA98","v":0}]
[null,"Instalación de micromedidores en las tomas",{"$f":"IF('Acciones a Ejecutar'!B41=\"si\",'Premisas OPEX'!C41,0)/1000000","v":0},{"$f":"+C99","v":0},0,0,0,0,0,0,0,0,0,0,0,0,0,0,0,0,0,0,null,{"$f":"+C99*Evaluacion!O42","v":0},{"$f":"+D99*Evaluacion!P42+X99","v":0},{"$f":"+E99*Evaluacion!Q42+Y99","v":0},{"$f":"+F99*Evaluacion!R42+Z99","v":0},{"$f":"+G99*Evaluacion!S42+AA99","v":0}]
[null,"Sistematización de lectura de micromedidores en tomas e incorporación de lecturas al sistema de facturación y cobranza",{"$f":"IF('Acciones a Ejecutar'!B42=\"si\",'Premisas OPEX'!C42,0)/1000000","v":0},{"$f":"+C100","v":0},0,0,0,0,0,0,0,0,0,0,0,0,0,0,0,0,0,0,null,{"$f":"+C100*Evaluacion!O43","v":0},{"$f":"+D100*Evaluacion!P43+X100","v":0},{"$f":"+E100*Evaluacion!Q43+Y100","v":0},{"$f":"+F100*Evaluacion!R43+Z100","v":0},{"$f":"+G100*Evaluacion!S43+AA100","v":0}]
[null,"Optimización hidráulica: sectorización de la red de distribución, control de presión, optimización de la capacidad de almacenamiento.",{"$f":"IF('Acciones a Ejecutar'!B43=\"si\",'Premisas OPEX'!C43,0)/1000000","v":0},{"$f":"+C101","v":0},0,0,0,0,0,0,0,0,0,0,0,0,0,0,0,0,0,0,null,{"$f":"+C101*Evaluacion!O44","v":0},{"$f":"+D101*Evaluacion!P44+X101","v":0},{"$f":"+E101*Evaluacion!Q44+Y101","v":0},{"$f":"+F101*Evaluacion!R44+Z101","v":0},{"$f":"+G101*Evaluacion!S44+AA101","v":0}]
[null,"Catastro de infraestructura hidráulica y de redes",{"$f":"IF('Acciones a Ejecutar'!B44=\"si\",'Premisas OPEX'!C44,0)/1000000","v":0},{"$f":"+C102","v":0},0,0,0,0,0,0,0,0,0,0,0,0,0,0,0,0,0,0,null,{"$f":"+C102*Evaluacion!O45","v":0},{"$f":"+D102*Evaluacion!P45+X102","v":0},{"$f":"+E102*Evaluacion!Q45+Y102","v":0},{"$f":"+F102*Evaluacion!R45+Z102","v":0},{"$f":"+G102*Evaluacion!S45+AA102","v":0}]
[null,"Instalación de macromedidores en captaciones",{"$f":"IF('Acciones a Ejecutar'!B45=\"si\",'Premisas OPEX'!C45,0)/1000000","v":0},{"$f":"+C103","v":0},0,0,0,0,0,0,0,0,0,0,0,0,0,0,0,0,0,0,null,{"$f":"+C103*Evaluacion!O46","v":0},{"$f":"+D103*Evaluacion!P46+X103","v":0},{"$f":"+E103*Evaluacion!Q46+Y103","v":0},{"$f":"+F103*Evaluacion!R46+Z103","v":0},{"$f":"+G103*Evaluacion!S46+AA103","v":0}]
[null,"Instalación de macromedidores en sectores",{"$f":"IF('Acciones a Ejecutar'!B46=\"si\",'Premisas OPEX'!C46,0)/1000000","v":0},{"$f":"+C104","v":0},0,0,0,0,0,0,0,0,0,0,0,0,0,0,0,0,0,0,null,{"$f":"+C104*Evaluacion!O47","v":0},{"$f":"+D104*Evaluacion!P47+X104","v":0},{"$f":"+E104*Evaluacion!Q47+Y104","v":0},{"$f":"+F104*Evaluacion!R47+Z104","v":0},{"$f":"+G104*Evaluacion!S47+AA104","v":0}]
[null,"Sistematización de lectura de macromedidores en captaciones y sectores ( p.ej. a través de telemetría)",{"$f":"IF('Acciones a Ejecutar'!B47=\"si\",'Premisas OPEX'!C47,0)/1000000","v":0},{"$f":"+C105","v":0},0,0,0,0,0,0,0,0,0,0,0,0,0,0,0,0,0,0,null,{"$f":"+C105*Evaluacion!O48","v":0},{"$f":"+D105*Evaluacion!P48+X105","v":0},{"$f":"+E105*Evaluacion!Q48+Y105","v":0},{"$f":"+F105*Evaluacion!R48+Z105","v":0},{"$f":"+G105*Evaluacion!S48+AA105","v":0}]
[null,"Sustitución de tuberías con alto índice de fugas",{"$f":"IF('Acciones a Ejecutar'!B48=\"si\",'Premisas OPEX'!C48,0)/1000000","v":0},{"$f":"+C106","v":0},0,0,0,0,0,0,0,0,0,0,0,0,0,0,0,0,0,0,null,{"$f":"+C106*Evaluacion!O49","v":0},{"$f":"+D106*Evaluacion!P49+X106","v":0},{"$f":"+E106*Evaluacion!Q49+Y106","v":0},{"$f":"+F106*Evaluacion!R49+Z106","v":0},{"$f":"+G106*Evaluacion!S49+AA106","v":0}]
[null,"Capacitación del personal del OO en operación de equipos",{"$f":"IF('Acciones a Ejecutar'!B49=\"si\",'Premisas OPEX'!C49,0)/1000000","v":0},{"$f":"+C107","v":0},0,0,0,0,0,0,0,0,0,0,0,0,0,0,0,0,0,0,null,{"$f":"+C107*Evaluacion!O50","v":0},{"$f":"+D107*Evaluacion!P50+X107","v":0},{"$f":"+E107*Evaluacion!Q50+Y107","v":0},{"$f":"+F107*Evaluacion!R50+Z107","v":0},{"$f":"+G107*Evaluacion!S50+AA107","v":0}]
[null,"Sistema de Información Geográfica",{"$f":"IF('Acciones a Ejecutar'!B50=\"si\",'Premisas OPEX'!C50,0)/1000000","v":0},{"$f":"+C108","v":0},0,0,0,0,0,0,0,0,0,0,0,0,0,0,0,0,0,0,null,{"$f":"+C108*Evaluacion!O51","v":0},{"$f":"+D108*Evaluacion!P51+X108","v":0},{"$f":"+E108*Evaluacion!Q51+Y108","v":0},{"$f":"+F108*Evaluacion!R51+Z108","v":0},{"$f":"+G108*Evaluacion!S51+AA108","v":0}]
[null,"Total PAI de reducciòn de Pérdidas Físicas de Agua",{"$f":"SUM(C97:C108)","v":0},0,0,0,0,0,0,0,0,0,0,0,0,0,0,0,0,0,0,0,null,0,0,0,0,0]
[null,"5. PAI para sostenibilidad a las acciones "]
[null,{"$f":"+B55","v":"Establecimiento de un comité ciudadano del organismo operador"},{"$f":"IF('Acciones a Ejecutar'!B53=\"si\",'Premisas OPEX'!C53,0)/1000000","v":0},{"$f":"+C111","v":0},0,0,0,0,0,0,0,0,0,0,0,0,0,0,0,0,0,0,null,{"$f":"+C111*Evaluacion!O54","v":0},{"$f":"+D111*Evaluacion!P54+X111","v":0},{"$f":"+E111*Evaluacion!Q54+Y111","v":0},{"$f":"+F111*Evaluacion!R54+Z111","v":0},{"$f":"+G111*Evaluacion!S54+AA111","v":0}]
[null,{"$f":"+B56","v":"Elaboración de un código de ética y suscripción por parte del personal del OO"},{"$f":"IF('Acciones a Ejecutar'!B54=\"si\",'Premisas OPEX'!C54,0)/1000000","v":0},{"$f":"+C112","v":0},0,0,0,0,0,0,0,0,0,0,0,0,0,0,0,0,0,0,null,{"$f":"+C112*Evaluacion!O55","v":0},{"$f":"+D112*Evaluacion!P55+X112","v":0},{"$f":"+E112*Evaluacion!Q55+Y112","v":0},{"$f":"+F112*Evaluacion!R55+Z112","v":0},{"$f":"+G112*Evaluacion!S55+AA112","v":0}]
[null,{"$f":"+B57","v":"Sistema informático de contabilidad"},{"$f":"IF('Acciones a Ejecutar'!B55=\"si\",'Premisas OPEX'!C55,0)/1000000","v":0},{"$f":"+C113","v":0},0,0,0,0,0,0,0,0,0,0,0,0,0,0,0,0,0,0,null,{"$f":"+C113*Evaluacion!O56","v":0},{"$f":"+D113*Evaluacion!P56+X113","v":0},{"$f":"+E113*Evaluacion!Q56+Y113","v":0},{"$f":"+F113*Evaluacion!R56+Z113","v":0},{"$f":"+G113*Evaluacion!S56+AA113","v":0}]
[null,{"$f":"+B58","v":"Sistema de planeación Integral"},{"$f":"IF('Acciones a Ejecutar'!B56=\"si\",'Premisas OPEX'!C56,0)/1000000","v":0},{"$f":"+C114","v":0},0,0,0,0,0,0,0,0,0,0,0,0,0,0,0,0,0,0,null,{"$f":"+C114*Evaluacion!O57","v":0},{"$f":"+D114*Evaluacion!P57+X114","v":0},{"$f":"+E114*Evaluacion!Q57+Y114","v":0},{"$f":"+F114*Evaluacion!R57+Z114","v":0},{"$f":"+G114*Evaluacion!S57+AA114","v":0}]
[null,{"$f":"+B59","v":"Asesoría para financiamiento de contraparte"},{"$f":"IF('Acciones a Ejecutar'!B57=\"si\",'Premisas OPEX'!C57,0)/1000000","v":0},{"$f":"+C115","v":0},0,0,0,0,0,0,0,0,0,0,0,0,0,0,0,0,0,0,null,{"$f":"+C115*Evaluacion!O58","v":0}]
[null,"Total PAI para sostenibilidad a las acciones",{"$f":"+SUM(C111:C115)","v":0},0,0,0,0,0,0,0,0,0,0,0,0,0,0,0,0,0,0,0,null,{"$f":"+SUM(X111:X115)","v":0},{"$f":"+SUM(Y111:Y115)","v":0},{"$f":"+SUM(Z111:Z115)","v":0},{"$f":"+SUM(AA111:AA115)","v":0},{"$f":"+SUM(AB111:AB115)","v":0}]
[null,"Total PAIs",{"$f":"C116+C109+C95+C79+C74","v":0},0,0,0,0,0,0,0,0,0,0,0,0,0,0,0,0,0,0,0,null,{"$f":"X116+X109+X95+X79+X74","v":0},{"$f":"Y116+Y109+Y95+Y79+Y74","v":0},{"$f":"Z116+Z109+Z95+Z79+Z74","v":0},{"$f":"AA116+AA109+AA95+AA79+AA74","v":0},{"$f":"AB116+AB109+AB95+AB79+AB74","v":0}]
[]
[null,null,1,{"$f":"+C119+1","v":2},3,4,5,6,7,8,9,10,11,12,13,14,15,16,17,18,19,20]
[null,"Ingresos/beneficios PAI  (Millones de pesos)",{"$f":"+C64","v":1},{"$f":"+C120+1","v":2},3,4,5,6,7,8,9,10,11,12,13,14,15,16,17,18,19,20,null,{"$f":"+C120","v":1},{"$f":"+D120","v":2},{"$f":"+E120","v":3},{"$f":"+F120","v":4},{"$f":"+G120","v":5}]
[null,"1. PAI para reducir gastos de energía eléctrica"]
[null,{"$f":"+B66","v":"Solicitud de cambio de tarifa eléctrica para reducir gasto por concepto de energía eléctrica."},{"$f":"IF('Acciones a Ejecutar'!B8=\"si\",'Premisas Beneficios'!C8*'Proyecciones Base'!$C$25,0)/1000000","v":0},{"$f":"IFERROR(C122*'Proyecciones Base'!D$27/'Proyecciones Base'!C$27,0)","v":0},{"$f":"IFERROR(D122*'Proyecciones Base'!E$27/'Proyecciones Base'!D$27,0)","v":0},{"$f":"IFERROR(E122*'Proyecciones Base'!F$27/'Proyecciones Base'!E$27,0)","v":0},{"$f":"IFERROR(F122*'Proyecciones Base'!G$27/'Proyecciones Base'!F$27,0)","v":0},{"$f":"IFERROR(G122*'Proyecciones Base'!H$27/'Proyecciones Base'!G$27,0)","v":0},{"$f":"IFERROR(H122*'Proyecciones Base'!I$27/'Proyecciones Base'!H$27,0)","v":0},{"$f":"IFERROR(I122*'Proyecciones Base'!J$27/'Proyecciones Base'!I$27,0)","v":0},{"$f":"IFERROR(J122*'Proyecciones Base'!K$27/'Proyecciones Base'!J$27,0)","v":0},{"$f":"IFERROR(K122*'Proyecciones Base'!L$27/'Proyecciones Base'!K$27,0)","v":0},{"$f":"IFERROR(L122*'Proyecciones Base'!M$27/'Proyecciones Base'!L$27,0)","v":0},{"$f":"IFERROR(M122*'Proyecciones Base'!N$27/'Proyecciones Base'!M$27,0)","v":0},{"$f":"IFERROR(N122*'Proyecciones Base'!O$27/'Proyecciones Base'!N$27,0)","v":0},{"$f":"IFERROR(O122*'Proyecciones Base'!P$27/'Proyecciones Base'!O$27,0)","v":0},{"$f":"IFERROR(P122*'Proyecciones Base'!Q$27/'Proyecciones Base'!P$27,0)","v":0},{"$f":"IFERROR(Q122*'Proyecciones Base'!R$27/'Proyecciones Base'!Q$27,0)","v":0},{"$f":"IFERROR(R122*'Proyecciones Base'!S$27/'Proyecciones Base'!R$27,0)","v":0},{"$f":"IFERROR(S122*'Proyecciones Base'!T$27/'Proyecciones Base'!S$27,0)","v":0},{"$f":"IFERROR(T122*'Proyecciones Base'!U$27/'Proyecciones Base'!T$27,0)","v":0},{"$f":"IFERROR(U122*'Proyecciones Base'!V$27/'Proyecciones Base'!U$27,0)","v":0},null,{"$f":"+C122*Evaluacion!O9","v":0},{"$f":"+D122*Evaluacion!P9","v":0},{"$f":"+E122*Evaluacion!Q9","v":0},{"$f":"+F122*Evaluacion!R9","v":0},{"$f":"+G122*Evaluacion!S9","v":0}]
[null,"Reducción de la potencia reactiva (reducción del factor de potencia)",{"$f":"IF('Acciones a Ejecutar'!B9=\"si\",'Premisas Beneficios'!C9*'Proyecciones Base'!$C$25,0)/1000000","v":0},{"$f":"IFERROR(C123*'Proyecciones Base'!D$27/'Proyecciones Base'!C$27,0)","v":0},{"$f":"IFERROR(D123*'Proyecciones Base'!E$27/'Proyecciones Base'!D$27,0)","v":0},{"$f":"IFERROR(E123*'Proyecciones Base'!F$27/'Proyecciones Base'!E$27,0)","v":0},{"$f":"IFERROR(F123*'Proyecciones Base'!G$27/'Proyecciones Base'!F$27,0)","v":0},{"$f":"IFERROR(G123*'Proyecciones Base'!H$27/'Proyecciones Base'!G$27,0)","v":0},{"$f":"IFERROR(H123*'Proyecciones Base'!I$27/'Proyecciones Base'!H$27,0)","v":0},{"$f":"IFERROR(I123*'Proyecciones Base'!J$27/'Proyecciones Base'!I$27,0)","v":0},{"$f":"IFERROR(J123*'Proyecciones Base'!K$27/'Proyecciones Base'!J$27,0)","v":0},{"$f":"IFERROR(K123*'Proyecciones Base'!L$27/'Proyecciones Base'!K$27,0)","v":0},{"$f":"IFERROR(L123*'Proyecciones Base'!M$27/'Proyecciones Base'!L$27,0)","v":0},{"$f":"IFERROR(M123*'Proyecciones Base'!N$27/'Proyecciones Base'!M$27,0)","v":0},{"$f":"IFERROR(N123*'Proyecciones Base'!O$27/'Proyecciones Base'!N$27,0)","v":0},{"$f":"IFERROR(O123*'Proyecciones Base'!P$27/'Proyecciones Base'!O$27,0)","v":0},{"$f":"IFERROR(P123*'Proyecciones Base'!Q$27/'Proyecciones Base'!P$27,0)","v":0},{"$f":"IFERROR(Q123*'Proyecciones Base'!R$27/'Proyecciones Base'!Q$27,0)","v":0},{"$f":"IFERROR(R123*'Proyecciones Base'!S$27/'Proyecciones Base'!R$27,0)","v":0},{"$f":"IFERROR(S123*'Proyecciones Base'!T$27/'Proyecciones Base'!S$27,0)","v":0},{"$f":"IFERROR(T123*'Proyecciones Base'!U$27/'Proyecciones Base'!T$27,0)","v":0},{"$f":"IFERROR(U123*'Proyecciones Base'!V$27/'Proyecciones Base'!U$27,0)","v":0},null,{"$f":"+C123*Evaluacion!O10","v":0},{"$f":"+D123*Evaluacion!P10","v":0},{"$f":"+E123*Evaluacion!Q10","v":0},{"$f":"+F123*Evaluacion!R10","v":0},{"$f":"+G123*Evaluacion!S10","v":0}]
[null,"Sustitución de equipos de bombeo de agua potable para reducir consumo de energía",{"$f":"IF('Acciones a Ejecutar'!B10=\"si\",'Premisas Beneficios'!C10*'Proyecciones Base'!$C$25,0)/1000000","v":0},{"$f":"IFERROR(C124*'Proyecciones Base'!D$27/'Proyecciones Base'!C$27,0)","v":0},{"$f":"IFERROR(D124*'Proyecciones Base'!E$27/'Proyecciones Base'!D$27,0)","v":0},{"$f":"IFERROR(E124*'Proyecciones Base'!F$27/'Proyecciones Base'!E$27,0)","v":0},{"$f":"IFERROR(F124*'Proyecciones Base'!G$27/'Proyecciones Base'!F$27,0)","v":0},{"$f":"IFERROR(G124*'Proyecciones Base'!H$27/'Proyecciones Base'!G$27,0)","v":0},{"$f":"IFERROR(H124*'Proyecciones Base'!I$27/'Proyecciones Base'!H$27,0)","v":0},{"$f":"IFERROR(I124*'Proyecciones Base'!J$27/'Proyecciones Base'!I$27,0)","v":0},{"$f":"IFERROR(J124*'Proyecciones Base'!K$27/'Proyecciones Base'!J$27,0)","v":0},{"$f":"IFERROR(K124*'Proyecciones Base'!L$27/'Proyecciones Base'!K$27,0)","v":0},{"$f":"IFERROR(L124*'Proyecciones Base'!M$27/'Proyecciones Base'!L$27,0)","v":0},{"$f":"IFERROR(M124*'Proyecciones Base'!N$27/'Proyecciones Base'!M$27,0)","v":0},{"$f":"IFERROR(N124*'Proyecciones Base'!O$27/'Proyecciones Base'!N$27,0)","v":0},{"$f":"IFERROR(O124*'Proyecciones Base'!P$27/'Proyecciones Base'!O$27,0)","v":0},{"$f":"IFERROR(P124*'Proyecciones Base'!Q$27/'Proyecciones Base'!P$27,0)","v":0},{"$f":"IFERROR(Q124*'Proyecciones Base'!R$27/'Proyecciones Base'!Q$27,0)","v":0},{"$f":"IFERROR(R124*'Proyecciones Base'!S$27/'Proyecciones Base'!R$27,0)","v":0},{"$f":"IFERROR(S124*'Proyecciones Base'!T$27/'Proyecciones Base'!S$27,0)","v":0},{"$f":"IFERROR(T124*'Proyecciones Base'!U$27/'Proyecciones Base'!T$27,0)","v":0},{"$f":"IFERROR(U124*'Proyecciones Base'!V$27/'Proyecciones Base'!U$27,0)","v":0},null,{"$f":"+C124*Evaluacion!O11","v":0},{"$f":"+D124*Evaluacion!P11","v":0},{"$f":"+E124*Evaluacion!Q11","v":0},{"$f":"+F124*Evaluacion!R11","v":0},{"$f":"+G124*Evaluacion!S11","v":0}]
[null,"Sustitución o construcción de tanques de almacenamiento de agua para modificar políticas de operación del equipo de bombeo",{"$f":"IF('Acciones a Ejecutar'!$B11=\"si\",'Premisas Beneficios'!$C$11*'Proyecciones Base'!$C$25*'Proyecciones Base'!C27/'Proyecciones Base'!$C$27+'Premisas Beneficios'!$E$11*'Proyecciones Base'!C14,0)/1000000","v":0},{"$f":"IF('Acciones a Ejecutar'!$B11=\"si\",'Premisas Beneficios'!$C$11*'Proyecciones Base'!$C$25*'Proyecciones Base'!D27/'Proyecciones Base'!$C$27+'Premisas Beneficios'!$E$11*'Proyecciones Base'!D14,0)/1000000","v":0},{"$f":"IF('Acciones a Ejecutar'!$B11=\"si\",'Premisas Beneficios'!$C$11*'Proyecciones Base'!$C$25*'Proyecciones Base'!E27/'Proyecciones Base'!$C$27+'Premisas Beneficios'!$E$11*'Proyecciones Base'!E14,0)/1000000","v":0},{"$f":"IF('Acciones a Ejecutar'!$B11=\"si\",'Premisas Beneficios'!$C$11*'Proyecciones Base'!$C$25*'Proyecciones Base'!F27/'Proyecciones Base'!$C$27+'Premisas Beneficios'!$E$11*'Proyecciones Base'!F14,0)/1000000","v":0},{"$f":"IF('Acciones a Ejecutar'!$B11=\"si\",'Premisas Beneficios'!$C$11*'Proyecciones Base'!$C$25*'Proyecciones Base'!G27/'Proyecciones Base'!$C$27+'Premisas Beneficios'!$E$11*'Proyecciones Base'!G14,0)/1000000","v":0},{"$f":"IF('Acciones a Ejecutar'!$B11=\"si\",'Premisas Beneficios'!$C$11*'Proyecciones Base'!$C$25*'Proyecciones Base'!H27/'Proyecciones Base'!$C$27+'Premisas Beneficios'!$E$11*'Proyecciones Base'!H14,0)/1000000","v":0},{"$f":"IF('Acciones a Ejecutar'!$B11=\"si\",'Premisas Beneficios'!$C$11*'Proyecciones Base'!$C$25*'Proyecciones Base'!I27/'Proyecciones Base'!$C$27+'Premisas Beneficios'!$E$11*'Proyecciones Base'!I14,0)/1000000","v":0},{"$f":"IF('Acciones a Ejecutar'!$B11=\"si\",'Premisas Beneficios'!$C$11*'Proyecciones Base'!$C$25*'Proyecciones Base'!J27/'Proyecciones Base'!$C$27+'Premisas Beneficios'!$E$11*'Proyecciones Base'!J14,0)/1000000","v":0},{"$f":"IF('Acciones a Ejecutar'!$B11=\"si\",'Premisas Beneficios'!$C$11*'Proyecciones Base'!$C$25*'Proyecciones Base'!K27/'Proyecciones Base'!$C$27+'Premisas Beneficios'!$E$11*'Proyecciones Base'!K14,0)/1000000","v":0},{"$f":"IF('Acciones a Ejecutar'!$B11=\"si\",'Premisas Beneficios'!$C$11*'Proyecciones Base'!$C$25*'Proyecciones Base'!L27/'Proyecciones Base'!$C$27+'Premisas Beneficios'!$E$11*'Proyecciones Base'!L14,0)/1000000","v":0},{"$f":"IF('Acciones a Ejecutar'!$B11=\"si\",'Premisas Beneficios'!$C$11*'Proyecciones Base'!$C$25*'Proyecciones Base'!M27/'Proyecciones Base'!$C$27+'Premisas Beneficios'!$E$11*'Proyecciones Base'!M14,0)/1000000","v":0},{"$f":"IF('Acciones a Ejecutar'!$B11=\"si\",'Premisas Beneficios'!$C$11*'Proyecciones Base'!$C$25*'Proyecciones Base'!N27/'Proyecciones Base'!$C$27+'Premisas Beneficios'!$E$11*'Proyecciones Base'!N14,0)/1000000","v":0},{"$f":"IF('Acciones a Ejecutar'!$B11=\"si\",'Premisas Beneficios'!$C$11*'Proyecciones Base'!$C$25*'Proyecciones Base'!O27/'Proyecciones Base'!$C$27+'Premisas Beneficios'!$E$11*'Proyecciones Base'!O14,0)/1000000","v":0},{"$f":"IF('Acciones a Ejecutar'!$B11=\"si\",'Premisas Beneficios'!$C$11*'Proyecciones Base'!$C$25*'Proyecciones Base'!P27/'Proyecciones Base'!$C$27+'Premisas Beneficios'!$E$11*'Proyecciones Base'!P14,0)/1000000","v":0},{"$f":"IF('Acciones a Ejecutar'!$B11=\"si\",'Premisas Beneficios'!$C$11*'Proyecciones Base'!$C$25*'Proyecciones Base'!Q27/'Proyecciones Base'!$C$27+'Premisas Beneficios'!$E$11*'Proyecciones Base'!Q14,0)/1000000","v":0},{"$f":"IF('Acciones a Ejecutar'!$B11=\"si\",'Premisas Beneficios'!$C$11*'Proyecciones Base'!$C$25*'Proyecciones Base'!R27/'Proyecciones Base'!$C$27+'Premisas Beneficios'!$E$11*'Proyecciones Base'!R14,0)/1000000","v":0},{"$f":"IF('Acciones a Ejecutar'!$B11=\"si\",'Premisas Beneficios'!$C$11*'Proyecciones Base'!$C$25*'Proyecciones Base'!S27/'Proyecciones Base'!$C$27+'Premisas Beneficios'!$E$11*'Proyecciones Base'!S14,0)/1000000","v":0},{"$f":"IF('Acciones a Ejecutar'!$B11=\"si\",'Premisas Beneficios'!$C$11*'Proyecciones Base'!$C$25*'Proyecciones Base'!T27/'Proyecciones Base'!$C$27+'Premisas Beneficios'!$E$11*'Proyecciones Base'!T14,0)/1000000","v":0},{"$f":"IF('Acciones a Ejecutar'!$B11=\"si\",'Premisas Beneficios'!$C$11*'Proyecciones Base'!$C$25*'Proyecciones Base'!U27/'Proyecciones Base'!$C$27+'Premisas Beneficios'!$E$11*'Proyecciones Base'!U14,0)/1000000","v":0},{"$f":"IF('Acciones a Ejecutar'!$B11=\"si\",'Premisas Beneficios'!$C$11*'Proyecciones Base'!$C$25*'Proyecciones Base'!V27/'Proyecciones Base'!$C$27+'Premisas Beneficios'!$E$11*'Proyecciones Base'!V14,0)/1000000","v":0},null,{"$f":"+C125*Evaluacion!O12","v":0},{"$f":"+D125*Evaluacion!P12","v":0},{"$f":"+E125*Evaluacion!Q12","v":0},{"$f":"+F125*Evaluacion!R12","v":0},{"$f":"+G125*Evaluacion!S12","v":0}]
[null,"Automatización de equipos de bombeo para modificar políticas de operación",{"$f":"IF('Acciones a Ejecutar'!$B12=\"si\",'Premisas Beneficios'!$C$12*'Proyecciones Base'!C$24+'Premisas Beneficios'!$E$12*'Datos basicos'!$B$24,0)/1000000","v":0},{"$f":"IF('Acciones a Ejecutar'!$B12=\"si\",'Premisas Beneficios'!$C$12*'Proyecciones Base'!D$24+'Premisas Beneficios'!$E$12*'Datos basicos'!$B$24,0)/1000000","v":0},{"$f":"IF('Acciones a Ejecutar'!$B12=\"si\",'Premisas Beneficios'!$C$12*'Proyecciones Base'!E$24+'Premisas Beneficios'!$E$12*'Datos basicos'!$B$24,0)/1000000","v":0},{"$f":"IF('Acciones a Ejecutar'!$B12=\"si\",'Premisas Beneficios'!$C$12*'Proyecciones Base'!F$24+'Premisas Beneficios'!$E$12*'Datos basicos'!$B$24,0)/1000000","v":0},{"$f":"IF('Acciones a Ejecutar'!$B12=\"si\",'Premisas Beneficios'!$C$12*'Proyecciones Base'!G$24+'Premisas Beneficios'!$E$12*'Datos basicos'!$B$24,0)/1000000","v":0},{"$f":"IF('Acciones a Ejecutar'!$B12=\"si\",'Premisas Beneficios'!$C$12*'Proyecciones Base'!H$24+'Premisas Beneficios'!$E$12*'Datos basicos'!$B$24,0)/1000000","v":0},{"$f":"IF('Acciones a Ejecutar'!$B12=\"si\",'Premisas Beneficios'!$C$12*'Proyecciones Base'!I$24+'Premisas Beneficios'!$E$12*'Datos basicos'!$B$24,0)/1000000","v":0},{"$f":"IF('Acciones a Ejecutar'!$B12=\"si\",'Premisas Beneficios'!$C$12*'Proyecciones Base'!J$24+'Premisas Beneficios'!$E$12*'Datos basicos'!$B$24,0)/1000000","v":0},{"$f":"IF('Acciones a Ejecutar'!$B12=\"si\",'Premisas Beneficios'!$C$12*'Proyecciones Base'!K$24+'Premisas Beneficios'!$E$12*'Datos basicos'!$B$24,0)/1000000","v":0},{"$f":"IF('Acciones a Ejecutar'!$B12=\"si\",'Premisas Beneficios'!$C$12*'Proyecciones Base'!L$24+'Premisas Beneficios'!$E$12*'Datos basicos'!$B$24,0)/1000000","v":0},{"$f":"IF('Acciones a Ejecutar'!$B12=\"si\",'Premisas Beneficios'!$C$12*'Proyecciones Base'!M$24+'Premisas Beneficios'!$E$12*'Datos basicos'!$B$24,0)/1000000","v":0},{"$f":"IF('Acciones a Ejecutar'!$B12=\"si\",'Premisas Beneficios'!$C$12*'Proyecciones Base'!N$24+'Premisas Beneficios'!$E$12*'Datos basicos'!$B$24,0)/1000000","v":0},{"$f":"IF('Acciones a Ejecutar'!$B12=\"si\",'Premisas Beneficios'!$C$12*'Proyecciones Base'!O$24+'Premisas Beneficios'!$E$12*'Datos basicos'!$B$24,0)/1000000","v":0},{"$f":"IF('Acciones a Ejecutar'!$B12=\"si\",'Premisas Beneficios'!$C$12*'Proyecciones Base'!P$24+'Premisas Beneficios'!$E$12*'Datos basicos'!$B$24,0)/1000000","v":0},{"$f":"IF('Acciones a Ejecutar'!$B12=\"si\",'Premisas Beneficios'!$C$12*'Proyecciones Base'!Q$24+'Premisas Beneficios'!$E$12*'Datos basicos'!$B$24,0)/1000000","v":0},{"$f":"IF('Acciones a Ejecutar'!$B12=\"si\",'Premisas Beneficios'!$C$12*'Proyecciones Base'!R$24+'Premisas Beneficios'!$E$12*'Datos basicos'!$B$24,0)/1000000","v":0},{"$f":"IF('Acciones a Ejecutar'!$B12=\"si\",'Premisas Beneficios'!$C$12*'Proyecciones Base'!S$24+'Premisas Beneficios'!$E$12*'Datos basicos'!$B$24,0)/1000000","v":0},{"$f":"IF('Acciones a Ejecutar'!$B12=\"si\",'Premisas Beneficios'!$C$12*'Proyecciones Base'!T$24+'Premisas Beneficios'!$E$12*'Datos basicos'!$B$24,0)/1000000","v":0},{"$f":"IF('Acciones a Ejecutar'!$B12=\"si\",'Premisas Beneficios'!$C$12*'Proyecciones Base'!U$24+'Premisas Beneficios'!$E$12*'Datos basicos'!$B$24,0)/1000000","v":0},{"$f":"IF('Acciones a Ejecutar'!$B12=\"si\",'Premisas Beneficios'!$C$12*'Proyecciones Base'!V$24+'Premisas Beneficios'!$E$12*'Datos basicos'!$B$24,0)/1000000","v":0},null,{"$f":"+C126*Evaluacion!O13","v":0},{"$f":"+D126*Evaluacion!P13","v":0},{"$f":"+E126*Evaluacion!Q13","v":0},{"$f":"+F126*Evaluacion!R13","v":0},{"$f":"+G126*Evaluacion!S13","v":0}]
[null,"Sustitución de bombas de alcantarillado",{"$f":"IF('Acciones a Ejecutar'!B13=\"si\",'Premisas Beneficios'!C13*'Proyecciones Base'!$C$25,0)/1000000","v":0},{"$f":"IFERROR(C127*'Proyecciones Base'!D$27/'Proyecciones Base'!C$27,0)","v":0},{"$f":"IFERROR(D127*'Proyecciones Base'!E$27/'Proyecciones Base'!D$27,0)","v":0},{"$f":"IFERROR(E127*'Proyecciones Base'!F$27/'Proyecciones Base'!E$27,0)","v":0},{"$f":"IFERROR(F127*'Proyecciones Base'!G$27/'Proyecciones Base'!F$27,0)","v":0},{"$f":"IFERROR(G127*'Proyecciones Base'!H$27/'Proyecciones Base'!G$27,0)","v":0},{"$f":"IFERROR(H127*'Proyecciones Base'!I$27/'Proyecciones Base'!H$27,0)","v":0},{"$f":"IFERROR(I127*'Proyecciones Base'!J$27/'Proyecciones Base'!I$27,0)","v":0},{"$f":"IFERROR(J127*'Proyecciones Base'!K$27/'Proyecciones Base'!J$27,0)","v":0},{"$f":"IFERROR(K127*'Proyecciones Base'!L$27/'Proyecciones Base'!K$27,0)","v":0},{"$f":"IFERROR(L127*'Proyecciones Base'!M$27/'Proyecciones Base'!L$27,0)","v":0},{"$f":"IFERROR(M127*'Proyecciones Base'!N$27/'Proyecciones Base'!M$27,0)","v":0},{"$f":"IFERROR(N127*'Proyecciones Base'!O$27/'Proyecciones Base'!N$27,0)","v":0},{"$f":"IFERROR(O127*'Proyecciones Base'!P$27/'Proyecciones Base'!O$27,0)","v":0},{"$f":"IFERROR(P127*'Proyecciones Base'!Q$27/'Proyecciones Base'!P$27,0)","v":0},{"$f":"IFERROR(Q127*'Proyecciones Base'!R$27/'Proyecciones Base'!Q$27,0)","v":0},{"$f":"IFERROR(R127*'Proyecciones Base'!S$27/'Proyecciones Base'!R$27,0)","v":0},{"$f":"IFERROR(S127*'Proyecciones Base'!T$27/'Proyecciones Base'!S$27,0)","v":0},{"$f":"IFERROR(T127*'Proyecciones Base'!U$27/'Proyecciones Base'!T$27,0)","v":0},{"$f":"IFERROR(U127*'Proyecciones Base'!V$27/'Proyecciones Base'!U$27,0)","v":0},null,{"$f":"+C127*Evaluacion!O14","v":0},{"$f":"+D127*Evaluacion!P14","v":0},{"$f":"+E127*Evaluacion!Q14","v":0},{"$f":"+F127*Evaluacion!R14","v":0},{"$f":"+G127*Evaluacion!S14","v":0}]
[null,"Reducción de gastos de energía en plantas de tratamiento de aguas residuales (PTAR)",{"$f":"IF('Acciones a Ejecutar'!B14=\"si\",'Premisas Beneficios'!C14*'Proyecciones Base'!$C$25,0)/1000000","v":0},{"$f":"IFERROR(C128*'Proyecciones Base'!D$27/'Proyecciones Base'!C$27,0)","v":0},{"$f":"IFERROR(D128*'Proyecciones Base'!E$27/'Proyecciones Base'!D$27,0)","v":0},{"$f":"IFERROR(E128*'Proyecciones Base'!F$27/'Proyecciones Base'!E$27,0)","v":0},{"$f":"IFERROR(F128*'Proyecciones Base'!G$27/'Proyecciones Base'!F$27,0)","v":0},{"$f":"IFERROR(G128*'Proyecciones Base'!H$27/'Proyecciones Base'!G$27,0)","v":0},{"$f":"IFERROR(H128*'Proyecciones Base'!I$27/'Proyecciones Base'!H$27,0)","v":0},{"$f":"IFERROR(I128*'Proyecciones Base'!J$27/'Proyecciones Base'!I$27,0)","v":0},{"$f":"IFERROR(J128*'Proyecciones Base'!K$27/'Proyecciones Base'!J$27,0)","v":0},{"$f":"IFERROR(K128*'Proyecciones Base'!L$27/'Proyecciones Base'!K$27,0)","v":0},{"$f":"IFERROR(L128*'Proyecciones Base'!M$27/'Proyecciones Base'!L$27,0)","v":0},{"$f":"IFERROR(M128*'Proyecciones Base'!N$27/'Proyecciones Base'!M$27,0)","v":0},{"$f":"IFERROR(N128*'Proyecciones Base'!O$27/'Proyecciones Base'!N$27,0)","v":0},{"$f":"IFERROR(O128*'Proyecciones Base'!P$27/'Proyecciones Base'!O$27,0)","v":0},{"$f":"IFERROR(P128*'Proyecciones Base'!Q$27/'Proyecciones Base'!P$27,0)","v":0},{"$f":"IFERROR(Q128*'Proyecciones Base'!R$27/'Proyecciones Base'!Q$27,0)","v":0},{"$f":"IFERROR(R128*'Proyecciones Base'!S$27/'Proyecciones Base'!R$27,0)","v":0},{"$f":"IFERROR(S128*'Proyecciones Base'!T$27/'Proyecciones Base'!S$27,0)","v":0},{"$f":"IFERROR(T128*'Proyecciones Base'!U$27/'Proyecciones Base'!T$27,0)","v":0},{"$f":"IFERROR(U128*'Proyecciones Base'!V$27/'Proyecciones Base'!U$27,0)","v":0},null,{"$f":"+C128*Evaluacion!O15","v":0},{"$f":"+D128*Evaluacion!P15","v":0},{"$f":"+E128*Evaluacion!Q15","v":0},{"$f":"+F128*Evaluacion!R15","v":0},{"$f":"+G128*Evaluacion!S15","v":0}]
[null,"Elaboración de una auditoría energética"]
[null,"Total Inversión PAI para reducción de gastos de energía eléctrica",{"$f":"+SUM(C122:C129)","v":0},0,0,0,0,0,0,0,0,0,0,0,0,0,0,0,0,0,0,0,null,0,0,0,0,0]
[null,"2. PAI para incrementar la productividad del personal "]
[null,{"$f":"+B76","v":"Programa de capacitación y profesionalización para incrementar la productividad del personal."},{"$f":"IF('Acciones a Ejecutar'!B18=\"si\",'Premisas Beneficios'!C18*'Proyecciones Base'!$C$21/1000,0)*'Datos basicos'!$B$28/1000000","v":0},{"$f":"+C132","v":0},0,0,0,0,0,0,0,0,0,0,0,0,0,0,0,0,0,0,null,{"$f":"+C132*Evaluacion!O19","v":0},{"$f":"+D132*Evaluacion!P19","v":0},{"$f":"+E132*Evaluacion!Q19","v":0},{"$f":"+F132*Evaluacion!R19","v":0},{"$f":"+G132*Evaluacion!S19","v":0}]
[null,{"$f":"+B77","v":"Revisión del manual de funciones y cargos del personal del OO"},{"$f":"IF('Acciones a Ejecutar'!B19=\"si\",'Premisas Beneficios'!C19*'Proyecciones Base'!$C$21/1000,0)*'Datos basicos'!$B$28/1000000","v":0},{"$f":"+C133","v":0},0,0,0,0,0,0,0,0,0,0,0,0,0,0,0,0,0,0,null,{"$f":"+C133*Evaluacion!O20","v":0},{"$f":"+D133*Evaluacion!P20","v":0},{"$f":"+E133*Evaluacion!Q20","v":0},{"$f":"+F133*Evaluacion!R20","v":0},{"$f":"+G133*Evaluacion!S20","v":0}]
[null,{"$f":"+B78","v":"Establecimiento de un programa de retiro voluntario y obligado"},{"$f":"IF('Acciones a Ejecutar'!B20=\"si\",'Premisas Beneficios'!C20*'Proyecciones Base'!$C$21/1000,0)*'Datos basicos'!$B$28/1000000","v":0},{"$f":"+C134","v":0},0,0,0,0,0,0,0,0,0,0,0,0,0,0,0,0,0,0,null,{"$f":"+C134*Evaluacion!O21","v":0},{"$f":"+D134*Evaluacion!P21","v":0},{"$f":"+E134*Evaluacion!Q21","v":0},{"$f":"+F134*Evaluacion!R21","v":0},{"$f":"+G134*Evaluacion!S21","v":0}]
[null,"Total Inversión PAI para incrementar la productividad del personal",{"$f":"SUM(C132:C134)","v":0},0,0,0,0,0,0,0,0,0,0,0,0,0,0,0,0,0,0,0,null,0,0,0,0,0]
[null,"3. PAI para mejora de la Gestión Comercial"]
[null,{"$f":"+B81","v":"Ajuste de consumos de cuota fija"},{"$f":"IF('Acciones a Ejecutar'!$B23=\"si\",'Premisas Beneficios'!$C$23*'Proyecciones Base'!$C$11*'Proyecciones Base'!C23,0)*'Datos basicos'!$B$14/1000000","v":0},{"$f":"IF('Acciones a Ejecutar'!$B23=\"si\",'Premisas Beneficios'!$C$23*'Proyecciones Base'!$C$11*'Proyecciones Base'!D23,0)*'Datos basicos'!$B$14/1000000","v":0},{"$f":"IF('Acciones a Ejecutar'!$B23=\"si\",'Premisas Beneficios'!$C$23*'Proyecciones Base'!$C$11*'Proyecciones Base'!E23,0)*'Datos basicos'!$B$14/1000000","v":0},{"$f":"IF('Acciones a Ejecutar'!$B23=\"si\",'Premisas Beneficios'!$C$23*'Proyecciones Base'!$C$11*'Proyecciones Base'!F23,0)*'Datos basicos'!$B$14/1000000","v":0},{"$f":"IF('Acciones a Ejecutar'!$B23=\"si\",'Premisas Beneficios'!$C$23*'Proyecciones Base'!$C$11*'Proyecciones Base'!G23,0)*'Datos basicos'!$B$14/1000000","v":0},{"$f":"IF('Acciones a Ejecutar'!$B23=\"si\",'Premisas Beneficios'!$C$23*'Proyecciones Base'!$C$11*'Proyecciones Base'!H23,0)*'Datos basicos'!$B$14/1000000","v":0},{"$f":"IF('Acciones a Ejecutar'!$B23=\"si\",'Premisas Beneficios'!$C$23*'Proyecciones Base'!$C$11*'Proyecciones Base'!I23,0)*'Datos basicos'!$B$14/1000000","v":0},{"$f":"IF('Acciones a Ejecutar'!$B23=\"si\",'Premisas Beneficios'!$C$23*'Proyecciones Base'!$C$11*'Proyecciones Base'!J23,0)*'Datos basicos'!$B$14/1000000","v":0},{"$f":"IF('Acciones a Ejecutar'!$B23=\"si\",'Premisas Beneficios'!$C$23*'Proyecciones Base'!$C$11*'Proyecciones Base'!K23,0)*'Datos basicos'!$B$14/1000000","v":0},{"$f":"IF('Acciones a Ejecutar'!$B23=\"si\",'Premisas Beneficios'!$C$23*'Proyecciones Base'!$C$11*'Proyecciones Base'!L23,0)*'Datos basicos'!$B$14/1000000","v":0},{"$f":"IF('Acciones a Ejecutar'!$B23=\"si\",'Premisas Beneficios'!$C$23*'Proyecciones Base'!$C$11*'Proyecciones Base'!M23,0)*'Datos basicos'!$B$14/1000000","v":0},{"$f":"IF('Acciones a Ejecutar'!$B23=\"si\",'Premisas Beneficios'!$C$23*'Proyecciones Base'!$C$11*'Proyecciones Base'!N23,0)*'Datos basicos'!$B$14/1000000","v":0},{"$f":"IF('Acciones a Ejecutar'!$B23=\"si\",'Premisas Beneficios'!$C$23*'Proyecciones Base'!$C$11*'Proyecciones Base'!O23,0)*'Datos basicos'!$B$14/1000000","v":0},{"$f":"IF('Acciones a Ejecutar'!$B23=\"si\",'Premisas Beneficios'!$C$23*'Proyecciones Base'!$C$11*'Proyecciones Base'!P23,0)*'Datos basicos'!$B$14/1000000","v":0},{"$f":"IF('Acciones a Ejecutar'!$B23=\"si\",'Premisas Beneficios'!$C$23*'Proyecciones Base'!$C$11*'Proyecciones Base'!Q23,0)*'Datos basicos'!$B$14/1000000","v":0},{"$f":"IF('Acciones a Ejecutar'!$B23=\"si\",'Premisas Beneficios'!$C$23*'Proyecciones Base'!$C$11*'Proyecciones Base'!R23,0)*'Datos basicos'!$B$14/1000000","v":0},{"$f":"IF('Acciones a Ejecutar'!$B23=\"si\",'Premisas Beneficios'!$C$23*'Proyecciones Base'!$C$11*'Proyecciones Base'!S23,0)*'Datos basicos'!$B$14/1000000","v":0},{"$f":"IF('Acciones a Ejecutar'!$B23=\"si\",'Premisas Beneficios'!$C$23*'Proyecciones Base'!$C$11*'Proyecciones Base'!T23,0)*'Datos basicos'!$B$14/1000000","v":0},{"$f":"IF('Acciones a Ejecutar'!$B23=\"si\",'Premisas Beneficios'!$C$23*'Proyecciones Base'!$C$11*'Proyecciones Base'!U23,0)*'Datos basicos'!$B$14/1000000","v":0},{"$f":"IF('Acciones a Ejecutar'!$B23=\"si\",'Premisas Beneficios'!$C$23*'Proyecciones Base'!$C$11*'Proyecciones Base'!V23,0)*'Datos basicos'!$B$14/1000000","v":0},null,{"$f":"+C137*Evaluacion!O24","v":0},{"$f":"+D137*Evaluacion!P24","v":0},{"$f":"+E137*Evaluacion!Q24","v":0},{"$f":"+F137*Evaluacion!R24","v":0},{"$f":"+G137*Evaluacion!S24","v":0}]
[null,"Corrección de errores de micromedición mediante sustitución de medidores.",{"$f":"IF('Acciones a Ejecutar'!B24=\"si\",'Premisas Beneficios'!C24*'Proyecciones Base'!C22*'Proyecciones Base'!C12,0)/1000000","v":0},{"$f":"IFERROR(C138*'Proyecciones Base'!D12/'Proyecciones Base'!C12,0)","v":0},{"$f":"+D138","v":0},0,0,0,0,0,0,0,0,0,0,0,0,0,0,0,0,0,null,{"$f":"+C138*Evaluacion!O25","v":0},{"$f":"+D138*Evaluacion!P25","v":0},{"$f":"+E138*Evaluacion!Q25","v":0},{"$f":"+F138*Evaluacion!R25","v":0},{"$f":"+G138*Evaluacion!S25","v":0}]
[null,"Impartición de cursos de formación de recursos humanos en eficiencia comercial",{"$f":"IF('Acciones a Ejecutar'!$B25=\"si\",'Premisas Beneficios'!$C25*'Proyecciones Base'!C$15,0)/1000000","v":0},{"$f":"IF('Acciones a Ejecutar'!$B25=\"si\",'Premisas Beneficios'!$C25*'Proyecciones Base'!D$15,0)/1000000","v":0},{"$f":"IF('Acciones a Ejecutar'!$B25=\"si\",'Premisas Beneficios'!$C25*'Proyecciones Base'!E$15,0)/1000000","v":0},{"$f":"IF('Acciones a Ejecutar'!$B25=\"si\",'Premisas Beneficios'!$C25*'Proyecciones Base'!F$15,0)/1000000","v":0},{"$f":"IF('Acciones a Ejecutar'!$B25=\"si\",'Premisas Beneficios'!$C25*'Proyecciones Base'!G$15,0)/1000000","v":0},{"$f":"IF('Acciones a Ejecutar'!$B25=\"si\",'Premisas Beneficios'!$C25*'Proyecciones Base'!H$15,0)/1000000","v":0},{"$f":"IF('Acciones a Ejecutar'!$B25=\"si\",'Premisas Beneficios'!$C25*'Proyecciones Base'!I$15,0)/1000000","v":0},{"$f":"IF('Acciones a Ejecutar'!$B25=\"si\",'Premisas Beneficios'!$C25*'Proyecciones Base'!J$15,0)/1000000","v":0},{"$f":"IF('Acciones a Ejecutar'!$B25=\"si\",'Premisas Beneficios'!$C25*'Proyecciones Base'!K$15,0)/1000000","v":0},{"$f":"IF('Acciones a Ejecutar'!$B25=\"si\",'Premisas Beneficios'!$C25*'Proyecciones Base'!L$15,0)/1000000","v":0},{"$f":"IF('Acciones a Ejecutar'!$B25=\"si\",'Premisas Beneficios'!$C25*'Proyecciones Base'!M$15,0)/1000000","v":0},{"$f":"IF('Acciones a Ejecutar'!$B25=\"si\",'Premisas Beneficios'!$C25*'Proyecciones Base'!N$15,0)/1000000","v":0},{"$f":"IF('Acciones a Ejecutar'!$B25=\"si\",'Premisas Beneficios'!$C25*'Proyecciones Base'!O$15,0)/1000000","v":0},{"$f":"IF('Acciones a Ejecutar'!$B25=\"si\",'Premisas Beneficios'!$C25*'Proyecciones Base'!P$15,0)/1000000","v":0},{"$f":"IF('Acciones a Ejecutar'!$B25=\"si\",'Premisas Beneficios'!$C25*'Proyecciones Base'!Q$15,0)/1000000","v":0},{"$f":"IF('Acciones a Ejecutar'!$B25=\"si\",'Premisas Beneficios'!$C25*'Proyecciones Base'!R$15,0)/1000000","v":0},{"$f":"IF('Acciones a Ejecutar'!$B25=\"si\",'Premisas Beneficios'!$C25*'Proyecciones Base'!S$15,0)/1000000","v":0},{"$f":"IF('Acciones a Ejecutar'!$B25=\"si\",'Premisas Beneficios'!$C25*'Proyecciones Base'!T$15,0)/1000000","v":0},{"$f":"IF('Acciones a Ejecutar'!$B25=\"si\",'Premisas Beneficios'!$C25*'Proyecciones Base'!U$15,0)/1000000","v":0},{"$f":"IF('Acciones a Ejecutar'!$B25=\"si\",'Premisas Beneficios'!$C25*'Proyecciones Base'!V$15,0)/1000000","v":0},null,{"$f":"+C139*Evaluacion!O26","v":0},{"$f":"+D139*Evaluacion!P26","v":0},{"$f":"+E139*Evaluacion!Q26","v":0},{"$f":"+F139*Evaluacion!R26","v":0},{"$f":"+G139*Evaluacion!S26","v":0}]
[null,"Impartición de cursos de formación de recursos humanos en atención a usuarios",{"$f":"IF('Acciones a Ejecutar'!$B26=\"si\",'Premisas Beneficios'!$C26*'Proyecciones Base'!C$15,0)/1000000","v":0},{"$f":"IF('Acciones a Ejecutar'!$B26=\"si\",'Premisas Beneficios'!$C26*'Proyecciones Base'!D$15,0)/1000000","v":0},{"$f":"IF('Acciones a Ejecutar'!$B26=\"si\",'Premisas Beneficios'!$C26*'Proyecciones Base'!E$15,0)/1000000","v":0},{"$f":"IF('Acciones a Ejecutar'!$B26=\"si\",'Premisas Beneficios'!$C26*'Proyecciones Base'!F$15,0)/1000000","v":0},{"$f":"IF('Acciones a Ejecutar'!$B26=\"si\",'Premisas Beneficios'!$C26*'Proyecciones Base'!G$15,0)/1000000","v":0},{"$f":"IF('Acciones a Ejecutar'!$B26=\"si\",'Premisas Beneficios'!$C26*'Proyecciones Base'!H$15,0)/1000000","v":0},{"$f":"IF('Acciones a Ejecutar'!$B26=\"si\",'Premisas Beneficios'!$C26*'Proyecciones Base'!I$15,0)/1000000","v":0},{"$f":"IF('Acciones a Ejecutar'!$B26=\"si\",'Premisas Beneficios'!$C26*'Proyecciones Base'!J$15,0)/1000000","v":0},{"$f":"IF('Acciones a Ejecutar'!$B26=\"si\",'Premisas Beneficios'!$C26*'Proyecciones Base'!K$15,0)/1000000","v":0},{"$f":"IF('Acciones a Ejecutar'!$B26=\"si\",'Premisas Beneficios'!$C26*'Proyecciones Base'!L$15,0)/1000000","v":0},{"$f":"IF('Acciones a Ejecutar'!$B26=\"si\",'Premisas Beneficios'!$C26*'Proyecciones Base'!M$15,0)/1000000","v":0},{"$f":"IF('Acciones a Ejecutar'!$B26=\"si\",'Premisas Beneficios'!$C26*'Proyecciones Base'!N$15,0)/1000000","v":0},{"$f":"IF('Acciones a Ejecutar'!$B26=\"si\",'Premisas Beneficios'!$C26*'Proyecciones Base'!O$15,0)/1000000","v":0},{"$f":"IF('Acciones a Ejecutar'!$B26=\"si\",'Premisas Beneficios'!$C26*'Proyecciones Base'!P$15,0)/1000000","v":0},{"$f":"IF('Acciones a Ejecutar'!$B26=\"si\",'Premisas Beneficios'!$C26*'Proyecciones Base'!Q$15,0)/1000000","v":0},{"$f":"IF('Acciones a Ejecutar'!$B26=\"si\",'Premisas Beneficios'!$C26*'Proyecciones Base'!R$15,0)/1000000","v":0},{"$f":"IF('Acciones a Ejecutar'!$B26=\"si\",'Premisas Beneficios'!$C26*'Proyecciones Base'!S$15,0)/1000000","v":0},{"$f":"IF('Acciones a Ejecutar'!$B26=\"si\",'Premisas Beneficios'!$C26*'Proyecciones Base'!T$15,0)/1000000","v":0},{"$f":"IF('Acciones a Ejecutar'!$B26=\"si\",'Premisas Beneficios'!$C26*'Proyecciones Base'!U$15,0)/1000000","v":0},{"$f":"IF('Acciones a Ejecutar'!$B26=\"si\",'Premisas Beneficios'!$C26*'Proyecciones Base'!V$15,0)/1000000","v":0},null,{"$f":"+C140*Evaluacion!O27","v":0},{"$f":"+D140*Evaluacion!P27","v":0},{"$f":"+E140*Evaluacion!Q27","v":0},{"$f":"+F140*Evaluacion!R27","v":0},{"$f":"+G140*Evaluacion!S27","v":0}]
[null,"Firma de convenios con bancos y otras instituciones para ampliar las opciones de pago de los servicios de agua y saneamiento",{"$f":"IF('Acciones a Ejecutar'!$B27=\"si\",'Premisas Beneficios'!$C27*'Proyecciones Base'!C$15,0)/1000000","v":0},{"$f":"IF('Acciones a Ejecutar'!$B27=\"si\",'Premisas Beneficios'!$C27*'Proyecciones Base'!D$15,0)/1000000","v":0},{"$f":"IF('Acciones a Ejecutar'!$B27=\"si\",'Premisas Beneficios'!$C27*'Proyecciones Base'!E$15,0)/1000000","v":0},{"$f":"IF('Acciones a Ejecutar'!$B27=\"si\",'Premisas Beneficios'!$C27*'Proyecciones Base'!F$15,0)/1000000","v":0},{"$f":"IF('Acciones a Ejecutar'!$B27=\"si\",'Premisas Beneficios'!$C27*'Proyecciones Base'!G$15,0)/1000000","v":0},{"$f":"IF('Acciones a Ejecutar'!$B27=\"si\",'Premisas Beneficios'!$C27*'Proyecciones Base'!H$15,0)/1000000","v":0},{"$f":"IF('Acciones a Ejecutar'!$B27=\"si\",'Premisas Beneficios'!$C27*'Proyecciones Base'!I$15,0)/1000000","v":0},{"$f":"IF('Acciones a Ejecutar'!$B27=\"si\",'Premisas Beneficios'!$C27*'Proyecciones Base'!J$15,0)/1000000","v":0},{"$f":"IF('Acciones a Ejecutar'!$B27=\"si\",'Premisas Beneficios'!$C27*'Proyecciones Base'!K$15,0)/1000000","v":0},{"$f":"IF('Acciones a Ejecutar'!$B27=\"si\",'Premisas Beneficios'!$C27*'Proyecciones Base'!L$15,0)/1000000","v":0},{"$f":"IF('Acciones a Ejecutar'!$B27=\"si\",'Premisas Beneficios'!$C27*'Proyecciones Base'!M$15,0)/1000000","v":0},{"$f":"IF('Acciones a Ejecutar'!$B27=\"si\",'Premisas Beneficios'!$C27*'Proyecciones Base'!N$15,0)/1000000","v":0},{"$f":"IF('Acciones a Ejecutar'!$B27=\"si\",'Premisas Beneficios'!$C27*'Proyecciones Base'!O$15,0)/1000000","v":0},{"$f":"IF('Acciones a Ejecutar'!$B27=\"si\",'Premisas Beneficios'!$C27*'Proyecciones Base'!P$15,0)/1000000","v":0},{"$f":"IF('Acciones a Ejecutar'!$B27=\"si\",'Premisas Beneficios'!$C27*'Proyecciones Base'!Q$15,0)/1000000","v":0},{"$f":"IF('Acciones a Ejecutar'!$B27=\"si\",'Premisas Beneficios'!$C27*'Proyecciones Base'!R$15,0)/1000000","v":0},{"$f":"IF('Acciones a Ejecutar'!$B27=\"si\",'Premisas Beneficios'!$C27*'Proyecciones Base'!S$15,0)/1000000","v":0},{"$f":"IF('Acciones a Ejecutar'!$B27=\"si\",'Premisas Beneficios'!$C27*'Proyecciones Base'!T$15,0)/1000000","v":0},{"$f":"IF('Acciones a Ejecutar'!$B27=\"si\",'Premisas Beneficios'!$C27*'Proyecciones Base'!U$15,0)/1000000","v":0},{"$f":"IF('Acciones a Ejecutar'!$B27=\"si\",'Premisas Beneficios'!$C27*'Proyecciones Base'!V$15,0)/1000000","v":0},null,{"$f":"+C141*Evaluacion!O28","v":0},{"$f":"+D141*Evaluacion!P28","v":0},{"$f":"+E141*Evaluacion!Q28","v":0},{"$f":"+F141*Evaluacion!R28","v":0},{"$f":"+G141*Evaluacion!S28","v":0}]
[null,"Mejoras a la facturación mediante un nuevo sistema comercial",{"$f":"IF('Acciones a Ejecutar'!$B28=\"si\",'Premisas Beneficios'!$C28*'Proyecciones Base'!C$15,0)/1000000","v":0},{"$f":"IF('Acciones a Ejecutar'!$B28=\"si\",'Premisas Beneficios'!$C28*'Proyecciones Base'!D$15,0)/1000000","v":0},{"$f":"IF('Acciones a Ejecutar'!$B28=\"si\",'Premisas Beneficios'!$C28*'Proyecciones Base'!E$15,0)/1000000","v":0},{"$f":"IF('Acciones a Ejecutar'!$B28=\"si\",'Premisas Beneficios'!$C28*'Proyecciones Base'!F$15,0)/1000000","v":0},{"$f":"IF('Acciones a Ejecutar'!$B28=\"si\",'Premisas Beneficios'!$C28*'Proyecciones Base'!G$15,0)/1000000","v":0},{"$f":"IF('Acciones a Ejecutar'!$B28=\"si\",'Premisas Beneficios'!$C28*'Proyecciones Base'!H$15,0)/1000000","v":0},{"$f":"IF('Acciones a Ejecutar'!$B28=\"si\",'Premisas Beneficios'!$C28*'Proyecciones Base'!I$15,0)/1000000","v":0},{"$f":"IF('Acciones a Ejecutar'!$B28=\"si\",'Premisas Beneficios'!$C28*'Proyecciones Base'!J$15,0)/1000000","v":0},{"$f":"IF('Acciones a Ejecutar'!$B28=\"si\",'Premisas Beneficios'!$C28*'Proyecciones Base'!K$15,0)/1000000","v":0},{"$f":"IF('Acciones a Ejecutar'!$B28=\"si\",'Premisas Beneficios'!$C28*'Proyecciones Base'!L$15,0)/1000000","v":0},{"$f":"IF('Acciones a Ejecutar'!$B28=\"si\",'Premisas Beneficios'!$C28*'Proyecciones Base'!M$15,0)/1000000","v":0},{"$f":"IF('Acciones a Ejecutar'!$B28=\"si\",'Premisas Beneficios'!$C28*'Proyecciones Base'!N$15,0)/1000000","v":0},{"$f":"IF('Acciones a Ejecutar'!$B28=\"si\",'Premisas Beneficios'!$C28*'Proyecciones Base'!O$15,0)/1000000","v":0},{"$f":"IF('Acciones a Ejecutar'!$B28=\"si\",'Premisas Beneficios'!$C28*'Proyecciones Base'!P$15,0)/1000000","v":0},{"$f":"IF('Acciones a Ejecutar'!$B28=\"si\",'Premisas Beneficios'!$C28*'Proyecciones Base'!Q$15,0)/1000000","v":0},{"$f":"IF('Acciones a Ejecutar'!$B28=\"si\",'Premisas Beneficios'!$C28*'Proyecciones Base'!R$15,0)/1000000","v":0},{"$f":"IF('Acciones a Ejecutar'!$B28=\"si\",'Premisas Beneficios'!$C28*'Proyecciones Base'!S$15,0)/1000000","v":0},{"$f":"IF('Acciones a Ejecutar'!$B28=\"si\",'Premisas Beneficios'!$C28*'Proyecciones Base'!T$15,0)/1000000","v":0},{"$f":"IF('Acciones a Ejecutar'!$B28=\"si\",'Premisas Beneficios'!$C28*'Proyecciones Base'!U$15,0)/1000000","v":0},{"$f":"IF('Acciones a Ejecutar'!$B28=\"si\",'Premisas Beneficios'!$C28*'Proyecciones Base'!V$15,0)/1000000","v":0},null,{"$f":"+C142*Evaluacion!O29","v":0},{"$f":"+D142*Evaluacion!P29","v":0},{"$f":"+E142*Evaluacion!Q29","v":0},{"$f":"+F142*Evaluacion!R29","v":0},{"$f":"+G142*Evaluacion!S29","v":0}]
[null,"Mejoras en la cobranza mediante esquemas que faciliten el pago.",{"$f":"IF('Acciones a Ejecutar'!$B29=\"si\",'Premisas Beneficios'!$C29*'Proyecciones Base'!C$15,0)/1000000","v":0},{"$f":"IF('Acciones a Ejecutar'!$B29=\"si\",'Premisas Beneficios'!$C29*'Proyecciones Base'!D$15,0)/1000000","v":0},{"$f":"IF('Acciones a Ejecutar'!$B29=\"si\",'Premisas Beneficios'!$C29*'Proyecciones Base'!E$15,0)/1000000","v":0},{"$f":"IF('Acciones a Ejecutar'!$B29=\"si\",'Premisas Beneficios'!$C29*'Proyecciones Base'!F$15,0)/1000000","v":0},{"$f":"IF('Acciones a Ejecutar'!$B29=\"si\",'Premisas Beneficios'!$C29*'Proyecciones Base'!G$15,0)/1000000","v":0},{"$f":"IF('Acciones a Ejecutar'!$B29=\"si\",'Premisas Beneficios'!$C29*'Proyecciones Base'!H$15,0)/1000000","v":0},{"$f":"IF('Acciones a Ejecutar'!$B29=\"si\",'Premisas Beneficios'!$C29*'Proyecciones Base'!I$15,0)/1000000","v":0},{"$f":"IF('Acciones a Ejecutar'!$B29=\"si\",'Premisas Beneficios'!$C29*'Proyecciones Base'!J$15,0)/1000000","v":0},{"$f":"IF('Acciones a Ejecutar'!$B29=\"si\",'Premisas Beneficios'!$C29*'Proyecciones Base'!K$15,0)/1000000","v":0},{"$f":"IF('Acciones a Ejecutar'!$B29=\"si\",'Premisas Beneficios'!$C29*'Proyecciones Base'!L$15,0)/1000000","v":0},{"$f":"IF('Acciones a Ejecutar'!$B29=\"si\",'Premisas Beneficios'!$C29*'Proyecciones Base'!M$15,0)/1000000","v":0},{"$f":"IF('Acciones a Ejecutar'!$B29=\"si\",'Premisas Beneficios'!$C29*'Proyecciones Base'!N$15,0)/1000000","v":0},{"$f":"IF('Acciones a Ejecutar'!$B29=\"si\",'Premisas Beneficios'!$C29*'Proyecciones Base'!O$15,0)/1000000","v":0},{"$f":"IF('Acciones a Ejecutar'!$B29=\"si\",'Premisas Beneficios'!$C29*'Proyecciones Base'!P$15,0)/1000000","v":0},{"$f":"IF('Acciones a Ejecutar'!$B29=\"si\",'Premisas Beneficios'!$C29*'Proyecciones Base'!Q$15,0)/1000000","v":0},{"$f":"IF('Acciones a Ejecutar'!$B29=\"si\",'Premisas Beneficios'!$C29*'Proyecciones Base'!R$15,0)/1000000","v":0},{"$f":"IF('Acciones a Ejecutar'!$B29=\"si\",'Premisas Beneficios'!$C29*'Proyecciones Base'!S$15,0)/1000000","v":0},{"$f":"IF('Acciones a Ejecutar'!$B29=\"si\",'Premisas Beneficios'!$C29*'Proyecciones Base'!T$15,0)/1000000","v":0},{"$f":"IF('Acciones a Ejecutar'!$B29=\"si\",'Premisas Beneficios'!$C29*'Proyecciones Base'!U$15,0)/1000000","v":0},{"$f":"IF('Acciones a Ejecutar'!$B29=\"si\",'Premisas Beneficios'!$C29*'Proyecciones Base'!V$15,0)/1000000","v":0},null,{"$f":"+C143*Evaluacion!O30","v":0},{"$f":"+D143*Evaluacion!P30","v":0},{"$f":"+E143*Evaluacion!Q30","v":0},{"$f":"+F143*Evaluacion!R30","v":0},{"$f":"+G143*Evaluacion!S30","v":0}]
[null,"Localización y regularización de tomas clandestinas",{"$f":"IF('Acciones a Ejecutar'!$B30=\"si\",'Premisas Beneficios'!$C30*'Proyecciones Base'!C$14,0)*'Proyecciones Base'!C17/1000000","v":0},{"$f":"IFERROR(IF('Acciones a Ejecutar'!$B30=\"si\",'Premisas Beneficios'!$C30*'Proyecciones Base'!D$14,0)*'Proyecciones Base'!D$17*('Proyecciones Base'!D$13/'Proyecciones Base'!C$13)/1000000,0)","v":0},{"$f":"+D144","v":0},0,0,0,0,0,0,0,0,0,0,0,0,0,0,0,0,0,null,{"$f":"+C144*Evaluacion!O31","v":0},{"$f":"+D144*Evaluacion!P31","v":0},{"$f":"+E144*Evaluacion!Q31","v":0},{"$f":"+F144*Evaluacion!R31","v":0},{"$f":"+G144*Evaluacion!S31","v":0}]
[null,"Censo de usuarios para mejorar el padrón. Establecimiento de esquemas de actualización continua del padrón.",{"$f":"IF('Acciones a Ejecutar'!$B31=\"si\",('Premisas Beneficios'!$C31+'Premisas Beneficios'!E31)*'Proyecciones Base'!C$14,0)*'Proyecciones Base'!C17/1000000","v":0},{"$f":"IFERROR(IF('Acciones a Ejecutar'!$B31=\"si\",('Premisas Beneficios'!$C31+'Premisas Beneficios'!E31)*'Proyecciones Base'!D$14,0)*'Proyecciones Base'!D$17*('Proyecciones Base'!D$13/'Proyecciones Base'!C$13)/1000000,0)","v":0},{"$f":"+D145","v":0},0,0,0,0,0,0,0,0,0,0,0,0,0,0,0,0,0,null,{"$f":"+C145*Evaluacion!O32","v":0},{"$f":"+D145*Evaluacion!P32","v":0},{"$f":"+E145*Evaluacion!Q32","v":0},{"$f":"+F145*Evaluacion!R32","v":0},{"$f":"+G145*Evaluacion!S32","v":0}]
[null,"Sistema de cómputo para altas y bajas del padrón de usuarios.",{"$f":"IF('Acciones a Ejecutar'!$B32=\"si\",'Premisas Beneficios'!$C32*'Proyecciones Base'!C$14,0)*'Proyecciones Base'!C17/1000000","v":0},{"$f":"IFERROR(IF('Acciones a Ejecutar'!$B32=\"si\",'Premisas Beneficios'!$C32*'Proyecciones Base'!D$14,0)*'Proyecciones Base'!D$17*('Proyecciones Base'!D$13/'Proyecciones Base'!C$13)/1000000,0)","v":0},{"$f":"+D146","v":0},0,0,0,0,0,0,0,0,0,0,0,0,0,0,0,0,0,null,{"$f":"+C146*Evaluacion!O33","v":0},{"$f":"+D146*Evaluacion!P33","v":0},{"$f":"+E146*Evaluacion!Q33","v":0},{"$f":"+F146*Evaluacion!R33","v":0},{"$f":"+G146*Evaluacion!S33","v":0}]
[null,"Estudio tarifario con el fin de realizar la actualización de las tarifas de agua",{"$f":"IF('Acciones a Ejecutar'!$B33=\"si\",'Premisas Beneficios'!$C33*'Proyecciones Base'!C$14,0)*'Proyecciones Base'!C$17/1000000","v":0},{"$f":"IFERROR(IF('Acciones a Ejecutar'!$B33=\"si\",'Premisas Beneficios'!$C33*'Proyecciones Base'!D$14,0)*'Proyecciones Base'!D$17*('Proyecciones Base'!D$13/'Proyecciones Base'!C$13)/1000000,0)","v":0},{"$f":"+D147","v":0},0,0,0,0,0,0,0,0,0,0,0,0,0,0,0,0,0,null,{"$f":"+C147*Evaluacion!O34","v":0},{"$f":"+D147*Evaluacion!P34","v":0},{"$f":"+E147*Evaluacion!Q34","v":0},{"$f":"+F147*Evaluacion!R34","v":0},{"$f":"+G147*Evaluacion!S34","v":0}]
[null,"Modificaciones a la estructura tarifaria",{"$f":"IF('Acciones a Ejecutar'!$B34=\"si\",'Premisas Beneficios'!$C34*'Proyecciones Base'!C$14,0)*'Proyecciones Base'!C$17/1000000","v":0},{"$f":"IFERROR(IF('Acciones a Ejecutar'!$B34=\"si\",'Premisas Beneficios'!$C34*'Proyecciones Base'!D$14,0)*'Proyecciones Base'!D$17*('Proyecciones Base'!D$13/'Proyecciones Base'!C$13)/1000000,0)","v":0},{"$f":"+D148","v":0},0,0,0,0,0,0,0,0,0,0,0,0,0,0,0,0,0,null,{"$f":"+C148*Evaluacion!O35","v":0},{"$f":"+D148*Evaluacion!P35","v":0},{"$f":"+E148*Evaluacion!Q35","v":0},{"$f":"+F148*Evaluacion!R35","v":0},{"$f":"+G148*Evaluacion!S35","v":0}]
[null,"Reformas para lograr que las tarifas se actualicen de manera continua"]
[null,"Reformas al marco legal para que el OO pueda establecer tarifas adecuadas"]
[null,"Total PAI para mejora de la Gestión Comercial",{"$f":"SUM(C137:C150)","v":0},0,0,0,0,0,0,0,0,0,0,0,0,0,0,0,0,0,0,0,null,0,0,0,0,0]
[null,"4. PAI para reducción de Pérdidas Físicas de Agua"]
[null,{"$f":"+B97","v":"Localización y reparación de fugas en tanques"},{"$f":"IFERROR(IF('Acciones a Ejecutar'!$B39=\"si\",('Proyecciones Base'!C$26/'Proyecciones Base'!$C$28-'Proyecciones Base'!C$26/('Proyecciones Base'!$C$28))*'Datos basicos'!$B18/1000000,0),0)","v":0},{"$f":"IFERROR(IF('Acciones a Ejecutar'!$B39=\"si\",('Proyecciones Base'!D$26/'Proyecciones Base'!$C$28-'Proyecciones Base'!D$26/('Proyecciones Base'!$C$28+'Premisas Beneficios'!$C39))*'Datos basicos'!$B$18/1000000,0),0)+IF('Acciones a Ejecutar'!$B39=\"si\",'Premisas Beneficios'!$C39*'Datos basicos'!$B$19*'Datos basicos'!$B$20,0)/1000000","v":0},{"$f":"IFERROR(IF('Acciones a Ejecutar'!$B39=\"si\",('Proyecciones Base'!E$26/'Proyecciones Base'!$C$28-'Proyecciones Base'!E$26/('Proyecciones Base'!$C$28+'Premisas Beneficios'!$C39))*'Datos basicos'!$B$18/1000000,0),0)","v":0},{"$f":"IFERROR(IF('Acciones a Ejecutar'!$B39=\"si\",('Proyecciones Base'!F$26/'Proyecciones Base'!$C$28-'Proyecciones Base'!F$26/('Proyecciones Base'!$C$28+'Premisas Beneficios'!$C39))*'Datos basicos'!$B$18/1000000,0),0)","v":0},{"$f":"IFERROR(IF('Acciones a Ejecutar'!$B39=\"si\",('Proyecciones Base'!G$26/'Proyecciones Base'!$C$28-'Proyecciones Base'!G$26/('Proyecciones Base'!$C$28+'Premisas Beneficios'!$C39))*'Datos basicos'!$B$18/1000000,0),0)","v":0},{"$f":"IFERROR(IF('Acciones a Ejecutar'!$B39=\"si\",('Proyecciones Base'!H$26/'Proyecciones Base'!$C$28-'Proyecciones Base'!H$26/('Proyecciones Base'!$C$28+'Premisas Beneficios'!$C39))*'Datos basicos'!$B$18/1000000,0),0)","v":0},{"$f":"IFERROR(IF('Acciones a Ejecutar'!$B39=\"si\",('Proyecciones Base'!I$26/'Proyecciones Base'!$C$28-'Proyecciones Base'!I$26/('Proyecciones Base'!$C$28+'Premisas Beneficios'!$C39))*'Datos basicos'!$B$18/1000000,0),0)","v":0},{"$f":"IFERROR(IF('Acciones a Ejecutar'!$B39=\"si\",('Proyecciones Base'!J$26/'Proyecciones Base'!$C$28-'Proyecciones Base'!J$26/('Proyecciones Base'!$C$28+'Premisas Beneficios'!$C39))*'Datos basicos'!$B$18/1000000,0),0)","v":0},{"$f":"IFERROR(IF('Acciones a Ejecutar'!$B39=\"si\",('Proyecciones Base'!K$26/'Proyecciones Base'!$C$28-'Proyecciones Base'!K$26/('Proyecciones Base'!$C$28+'Premisas Beneficios'!$C39))*'Datos basicos'!$B$18/1000000,0),0)","v":0},{"$f":"IFERROR(IF('Acciones a Ejecutar'!$B39=\"si\",('Proyecciones Base'!L$26/'Proyecciones Base'!$C$28-'Proyecciones Base'!L$26/('Proyecciones Base'!$C$28+'Premisas Beneficios'!$C39))*'Datos basicos'!$B$18/1000000,0),0)","v":0},{"$f":"IFERROR(IF('Acciones a Ejecutar'!$B39=\"si\",('Proyecciones Base'!M$26/'Proyecciones Base'!$C$28-'Proyecciones Base'!M$26/('Proyecciones Base'!$C$28+'Premisas Beneficios'!$C39))*'Datos basicos'!$B$18/1000000,0),0)","v":0},{"$f":"IFERROR(IF('Acciones a Ejecutar'!$B39=\"si\",('Proyecciones Base'!N$26/'Proyecciones Base'!$C$28-'Proyecciones Base'!N$26/('Proyecciones Base'!$C$28+'Premisas Beneficios'!$C39))*'Datos basicos'!$B$18/1000000,0),0)","v":0},{"$f":"IFERROR(IF('Acciones a Ejecutar'!$B39=\"si\",('Proyecciones Base'!O$26/'Proyecciones Base'!$C$28-'Proyecciones Base'!O$26/('Proyecciones Base'!$C$28+'Premisas Beneficios'!$C39))*'Datos basicos'!$B$18/1000000,0),0)","v":0},{"$f":"IFERROR(IF('Acciones a Ejecutar'!$B39=\"si\",('Proyecciones Base'!P$26/'Proyecciones Base'!$C$28-'Proyecciones Base'!P$26/('Proyecciones Base'!$C$28+'Premisas Beneficios'!$C39))*'Datos basicos'!$B$18/1000000,0),0)","v":0},{"$f":"IFERROR(IF('Acciones a Ejecutar'!$B39=\"si\",('Proyecciones Base'!Q$26/'Proyecciones Base'!$C$28-'Proyecciones Base'!Q$26/('Proyecciones Base'!$C$28+'Premisas Beneficios'!$C39))*'Datos basicos'!$B$18/1000000,0),0)","v":0},{"$f":"IFERROR(IF('Acciones a Ejecutar'!$B39=\"si\",('Proyecciones Base'!R$26/'Proyecciones Base'!$C$28-'Proyecciones Base'!R$26/('Proyecciones Base'!$C$28+'Premisas Beneficios'!$C39))*'Datos basicos'!$B$18/1000000,0),0)","v":0},{"$f":"IFERROR(IF('Acciones a Ejecutar'!$B39=\"si\",('Proyecciones Base'!S$26/'Proyecciones Base'!$C$28-'Proyecciones Base'!S$26/('Proyecciones Base'!$C$28+'Premisas Beneficios'!$C39))*'Datos basicos'!$B$18/1000000,0),0)","v":0},{"$f":"IFERROR(IF('Acciones a Ejecutar'!$B39=\"si\",('Proyecciones Base'!T$26/'Proyecciones Base'!$C$28-'Proyecciones Base'!T$26/('Proyecciones Base'!$C$28+'Premisas Beneficios'!$C39))*'Datos basicos'!$B$18/1000000,0),0)","v":0},{"$f":"IFERROR(IF('Acciones a Ejecutar'!$B39=\"si\",('Proyecciones Base'!U$26/'Proyecciones Base'!$C$28-'Proyecciones Base'!U$26/('Proyecciones Base'!$C$28+'Premisas Beneficios'!$C39))*'Datos basicos'!$B$18/1000000,0),0)","v":0},{"$f":"IFERROR(IF('Acciones a Ejecutar'!$B39=\"si\",('Proyecciones Base'!V$26/'Proyecciones Base'!$C$28-'Proyecciones Base'!V$26/('Proyecciones Base'!$C$28+'Premisas Beneficios'!$C39))*'Datos basicos'!$B$18/1000000,0),0)","v":0},null,{"$f":"+C153*Evaluacion!O40","v":0},{"$f":"+D153*Evaluacion!P40","v":0},{"$f":"+E153*Evaluacion!Q40","v":0},{"$f":"+F153*Evaluacion!R40","v":0},{"$f":"+G153*Evaluacion!S40","v":0}]
[null,"Localización y reparación de fugas en tuberías principales y secundarias",{"$f":"IFERROR(IF('Acciones a Ejecutar'!$B40=\"si\",('Proyecciones Base'!C$26/'Proyecciones Base'!$C$28-'Proyecciones Base'!C$26/('Proyecciones Base'!$C$28))*'Datos basicos'!$B18/1000000,0),0)","v":0},{"$f":"IFERROR(IF('Acciones a Ejecutar'!$B40=\"si\",('Proyecciones Base'!D$26/'Proyecciones Base'!$C$28-'Proyecciones Base'!D$26/('Proyecciones Base'!$C$28+'Premisas Beneficios'!$C40))*'Datos basicos'!$B$18/1000000,0),0)+IF('Acciones a Ejecutar'!$B40=\"si\",'Premisas Beneficios'!$C40*'Datos basicos'!$B$19*'Datos basicos'!$B$20,0)/1000000","v":0},{"$f":"IFERROR(IF('Acciones a Ejecutar'!$B40=\"si\",('Proyecciones Base'!E$26/'Proyecciones Base'!$C$28-'Proyecciones Base'!E$26/('Proyecciones Base'!$C$28+'Premisas Beneficios'!$C40))*'Datos basicos'!$B$18/1000000,0),0)","v":0},{"$f":"IFERROR(IF('Acciones a Ejecutar'!$B40=\"si\",('Proyecciones Base'!F$26/'Proyecciones Base'!$C$28-'Proyecciones Base'!F$26/('Proyecciones Base'!$C$28+'Premisas Beneficios'!$C40))*'Datos basicos'!$B$18/1000000,0),0)","v":0},{"$f":"IFERROR(IF('Acciones a Ejecutar'!$B40=\"si\",('Proyecciones Base'!G$26/'Proyecciones Base'!$C$28-'Proyecciones Base'!G$26/('Proyecciones Base'!$C$28+'Premisas Beneficios'!$C40))*'Datos basicos'!$B$18/1000000,0),0)","v":0},{"$f":"IFERROR(IF('Acciones a Ejecutar'!$B40=\"si\",('Proyecciones Base'!H$26/'Proyecciones Base'!$C$28-'Proyecciones Base'!H$26/('Proyecciones Base'!$C$28+'Premisas Beneficios'!$C40))*'Datos basicos'!$B$18/1000000,0),0)","v":0},{"$f":"IFERROR(IF('Acciones a Ejecutar'!$B40=\"si\",('Proyecciones Base'!I$26/'Proyecciones Base'!$C$28-'Proyecciones Base'!I$26/('Proyecciones Base'!$C$28+'Premisas Beneficios'!$C40))*'Datos basicos'!$B$18/1000000,0),0)","v":0},{"$f":"IFERROR(IF('Acciones a Ejecutar'!$B40=\"si\",('Proyecciones Base'!J$26/'Proyecciones Base'!$C$28-'Proyecciones Base'!J$26/('Proyecciones Base'!$C$28+'Premisas Beneficios'!$C40))*'Datos basicos'!$B$18/1000000,0),0)","v":0},{"$f":"IFERROR(IF('Acciones a Ejecutar'!$B40=\"si\",('Proyecciones Base'!K$26/'Proyecciones Base'!$C$28-'Proyecciones Base'!K$26/('Proyecciones Base'!$C$28+'Premisas Beneficios'!$C40))*'Datos basicos'!$B$18/1000000,0),0)","v":0},{"$f":"IFERROR(IF('Acciones a Ejecutar'!$B40=\"si\",('Proyecciones Base'!L$26/'Proyecciones Base'!$C$28-'Proyecciones Base'!L$26/('Proyecciones Base'!$C$28+'Premisas Beneficios'!$C40))*'Datos basicos'!$B$18/1000000,0),0)","v":0},{"$f":"IFERROR(IF('Acciones a Ejecutar'!$B40=\"si\",('Proyecciones Base'!M$26/'Proyecciones Base'!$C$28-'Proyecciones Base'!M$26/('Proyecciones Base'!$C$28+'Premisas Beneficios'!$C40))*'Datos basicos'!$B$18/1000000,0),0)","v":0},{"$f":"IFERROR(IF('Acciones a Ejecutar'!$B40=\"si\",('Proyecciones Base'!N$26/'Proyecciones Base'!$C$28-'Proyecciones Base'!N$26/('Proyecciones Base'!$C$28+'Premisas Beneficios'!$C40))*'Datos basicos'!$B$18/1000000,0),0)","v":0},{"$f":"IFERROR(IF('Acciones a Ejecutar'!$B40=\"si\",('Proyecciones Base'!O$26/'Proyecciones Base'!$C$28-'Proyecciones Base'!O$26/('Proyecciones Base'!$C$28+'Premisas Beneficios'!$C40))*'Datos basicos'!$B$18/1000000,0),0)","v":0},{"$f":"IFERROR(IF('Acciones a Ejecutar'!$B40=\"si\",('Proyecciones Base'!P$26/'Proyecciones Base'!$C$28-'Proyecciones Base'!P$26/('Proyecciones Base'!$C$28+'Premisas Beneficios'!$C40))*'Datos basicos'!$B$18/1000000,0),0)","v":0},{"$f":"IFERROR(IF('Acciones a Ejecutar'!$B40=\"si\",('Proyecciones Base'!Q$26/'Proyecciones Base'!$C$28-'Proyecciones Base'!Q$26/('Proyecciones Base'!$C$28+'Premisas Beneficios'!$C40))*'Datos basicos'!$B$18/1000000,0),0)","v":0},{"$f":"IFERROR(IF('Acciones a Ejecutar'!$B40=\"si\",('Proyecciones Base'!R$26/'Proyecciones Base'!$C$28-'Proyecciones Base'!R$26/('Proyecciones Base'!$C$28+'Premisas Beneficios'!$C40))*'Datos basicos'!$B$18/1000000,0),0)","v":0},{"$f":"IFERROR(IF('Acciones a Ejecutar'!$B40=\"si\",('Proyecciones Base'!S$26/'Proyecciones Base'!$C$28-'Proyecciones Base'!S$26/('Proyecciones Base'!$C$28+'Premisas Beneficios'!$C40))*'Datos basicos'!$B$18/1000000,0),0)","v":0},{"$f":"IFERROR(IF('Acciones a Ejecutar'!$B40=\"si\",('Proyecciones Base'!T$26/'Proyecciones Base'!$C$28-'Proyecciones Base'!T$26/('Proyecciones Base'!$C$28+'Premisas Beneficios'!$C40))*'Datos basicos'!$B$18/1000000,0),0)","v":0},{"$f":"IFERROR(IF('Acciones a Ejecutar'!$B40=\"si\",('Proyecciones Base'!U$26/'Proyecciones Base'!$C$28-'Proyecciones Base'!U$26/('Proyecciones Base'!$C$28+'Premisas Beneficios'!$C40))*'Datos basicos'!$B$18/1000000,0),0)","v":0},{"$f":"IFERROR(IF('Acciones a Ejecutar'!$B40=\"si\",('Proyecciones Base'!V$26/'Proyecciones Base'!$C$28-'Proyecciones Base'!V$26/('Proyecciones Base'!$C$28+'Premisas Beneficios'!$C40))*'Datos basicos'!$B$18/1000000,0),0)","v":0},null,{"$f":"+C154*Evaluacion!O41","v":0},{"$f":"+D154*Evaluacion!P41","v":0},{"$f":"+E154*Evaluacion!Q41","v":0},{"$f":"+F154*Evaluacion!R41","v":0},{"$f":"+G154*Evaluacion!S41","v":0}]
[null,"Instalación de micromedidores en las tomas",{"$f":"IFERROR(IF('Acciones a Ejecutar'!$B41=\"si\",('Proyecciones Base'!C$26/'Proyecciones Base'!$C$28-'Proyecciones Base'!C$26/('Proyecciones Base'!$C$28))*'Datos basicos'!$B18/1000000,0),0)","v":0},{"$f":"IFERROR(IF('Acciones a Ejecutar'!$B41=\"si\",('Proyecciones Base'!D$26/'Proyecciones Base'!$C$28-'Proyecciones Base'!D$26/('Proyecciones Base'!$C$28+'Premisas Beneficios'!$C41))*'Datos basicos'!$B$18/1000000,0),0)+IF('Acciones a Ejecutar'!$B41=\"si\",'Premisas Beneficios'!$C41*'Datos basicos'!$B$19*'Datos basicos'!$B$20,0)/1000000","v":0},{"$f":"IFERROR(IF('Acciones a Ejecutar'!$B41=\"si\",('Proyecciones Base'!E$26/'Proyecciones Base'!$C$28-'Proyecciones Base'!E$26/('Proyecciones Base'!$C$28+'Premisas Beneficios'!$C41))*'Datos basicos'!$B$18/1000000,0),0)","v":0},{"$f":"IFERROR(IF('Acciones a Ejecutar'!$B41=\"si\",('Proyecciones Base'!F$26/'Proyecciones Base'!$C$28-'Proyecciones Base'!F$26/('Proyecciones Base'!$C$28+'Premisas Beneficios'!$C41))*'Datos basicos'!$B$18/1000000,0),0)","v":0},{"$f":"IFERROR(IF('Acciones a Ejecutar'!$B41=\"si\",('Proyecciones Base'!G$26/'Proyecciones Base'!$C$28-'Proyecciones Base'!G$26/('Proyecciones Base'!$C$28+'Premisas Beneficios'!$C41))*'Datos basicos'!$B$18/1000000,0),0)","v":0},{"$f":"IFERROR(IF('Acciones a Ejecutar'!$B41=\"si\",('Proyecciones Base'!H$26/'Proyecciones Base'!$C$28-'Proyecciones Base'!H$26/('Proyecciones Base'!$C$28+'Premisas Beneficios'!$C41))*'Datos basicos'!$B$18/1000000,0),0)","v":0},{"$f":"IFERROR(IF('Acciones a Ejecutar'!$B41=\"si\",('Proyecciones Base'!I$26/'Proyecciones Base'!$C$28-'Proyecciones Base'!I$26/('Proyecciones Base'!$C$28+'Premisas Beneficios'!$C41))*'Datos basicos'!$B$18/1000000,0),0)","v":0},{"$f":"IFERROR(IF('Acciones a Ejecutar'!$B41=\"si\",('Proyecciones Base'!J$26/'Proyecciones Base'!$C$28-'Proyecciones Base'!J$26/('Proyecciones Base'!$C$28+'Premisas Beneficios'!$C41))*'Datos basicos'!$B$18/1000000,0),0)","v":0},{"$f":"IFERROR(IF('Acciones a Ejecutar'!$B41=\"si\",('Proyecciones Base'!K$26/'Proyecciones Base'!$C$28-'Proyecciones Base'!K$26/('Proyecciones Base'!$C$28+'Premisas Beneficios'!$C41))*'Datos basicos'!$B$18/1000000,0),0)","v":0},{"$f":"IFERROR(IF('Acciones a Ejecutar'!$B41=\"si\",('Proyecciones Base'!L$26/'Proyecciones Base'!$C$28-'Proyecciones Base'!L$26/('Proyecciones Base'!$C$28+'Premisas Beneficios'!$C41))*'Datos basicos'!$B$18/1000000,0),0)","v":0},{"$f":"IFERROR(IF('Acciones a Ejecutar'!$B41=\"si\",('Proyecciones Base'!M$26/'Proyecciones Base'!$C$28-'Proyecciones Base'!M$26/('Proyecciones Base'!$C$28+'Premisas Beneficios'!$C41))*'Datos basicos'!$B$18/1000000,0),0)","v":0},{"$f":"IFERROR(IF('Acciones a Ejecutar'!$B41=\"si\",('Proyecciones Base'!N$26/'Proyecciones Base'!$C$28-'Proyecciones Base'!N$26/('Proyecciones Base'!$C$28+'Premisas Beneficios'!$C41))*'Datos basicos'!$B$18/1000000,0),0)","v":0},{"$f":"IFERROR(IF('Acciones a Ejecutar'!$B41=\"si\",('Proyecciones Base'!O$26/'Proyecciones Base'!$C$28-'Proyecciones Base'!O$26/('Proyecciones Base'!$C$28+'Premisas Beneficios'!$C41))*'Datos basicos'!$B$18/1000000,0),0)","v":0},{"$f":"IFERROR(IF('Acciones a Ejecutar'!$B41=\"si\",('Proyecciones Base'!P$26/'Proyecciones Base'!$C$28-'Proyecciones Base'!P$26/('Proyecciones Base'!$C$28+'Premisas Beneficios'!$C41))*'Datos basicos'!$B$18/1000000,0),0)","v":0},{"$f":"IFERROR(IF('Acciones a Ejecutar'!$B41=\"si\",('Proyecciones Base'!Q$26/'Proyecciones Base'!$C$28-'Proyecciones Base'!Q$26/('Proyecciones Base'!$C$28+'Premisas Beneficios'!$C41))*'Datos basicos'!$B$18/1000000,0),0)","v":0},{"$f":"IFERROR(IF('Acciones a Ejecutar'!$B41=\"si\",('Proyecciones Base'!R$26/'Proyecciones Base'!$C$28-'Proyecciones Base'!R$26/('Proyecciones Base'!$C$28+'Premisas Beneficios'!$C41))*'Datos basicos'!$B$18/1000000,0),0)","v":0},{"$f":"IFERROR(IF('Acciones a Ejecutar'!$B41=\"si\",('Proyecciones Base'!S$26/'Proyecciones Base'!$C$28-'Proyecciones Base'!S$26/('Proyecciones Base'!$C$28+'Premisas Beneficios'!$C41))*'Datos basicos'!$B$18/1000000,0),0)","v":0},{"$f":"IFERROR(IF('Acciones a Ejecutar'!$B41=\"si\",('Proyecciones Base'!T$26/'Proyecciones Base'!$C$28-'Proyecciones Base'!T$26/('Proyecciones Base'!$C$28+'Premisas Beneficios'!$C41))*'Datos basicos'!$B$18/1000000,0),0)","v":0},{"$f":"IFERROR(IF('Acciones a Ejecutar'!$B41=\"si\",('Proyecciones Base'!U$26/'Proyecciones Base'!$C$28-'Proyecciones Base'!U$26/('Proyecciones Base'!$C$28+'Premisas Beneficios'!$C41))*'Datos basicos'!$B$18/1000000,0),0)","v":0},{"$f":"IFERROR(IF('Acciones a Ejecutar'!$B41=\"si\",('Proyecciones Base'!V$26/'Proyecciones Base'!$C$28-'Proyecciones Base'!V$26/('Proyecciones Base'!$C$28+'Premisas Beneficios'!$C41))*'Datos basicos'!$B$18/1000000,0),0)","v":0},null,{"$f":"+C155*Evaluacion!O42","v":0},{"$f":"+D155*Evaluacion!P42","v":0},{"$f":"+E155*Evaluacion!Q42","v":0},{"$f":"+F155*Evaluacion!R42","v":0},{"$f":"+G155*Evaluacion!S42","v":0}]
[null,"Sistematización de lectura de micromedidores en tomas e incorporación de lecturas al sistema de facturación y cobranza",{"$f":"IF('Acciones a Ejecutar'!$B42=\"si\",'Premisas Beneficios'!$C42*'Proyecciones Base'!C22*'Proyecciones Base'!C12,0)/1000000","v":0},{"$f":"IF('Acciones a Ejecutar'!$B42=\"si\",'Premisas Beneficios'!$C42*'Proyecciones Base'!D22*'Proyecciones Base'!D12,0)/1000000","v":0},{"$f":"IF('Acciones a Ejecutar'!$B42=\"si\",'Premisas Beneficios'!$C42*'Proyecciones Base'!E22*'Proyecciones Base'!E12,0)/1000000","v":0},{"$f":"IF('Acciones a Ejecutar'!$B42=\"si\",'Premisas Beneficios'!$C42*'Proyecciones Base'!F22*'Proyecciones Base'!F12,0)/1000000","v":0},{"$f":"IF('Acciones a Ejecutar'!$B42=\"si\",'Premisas Beneficios'!$C42*'Proyecciones Base'!G22*'Proyecciones Base'!G12,0)/1000000","v":0},{"$f":"IF('Acciones a Ejecutar'!$B42=\"si\",'Premisas Beneficios'!$C42*'Proyecciones Base'!H22*'Proyecciones Base'!H12,0)/1000000","v":0},{"$f":"IF('Acciones a Ejecutar'!$B42=\"si\",'Premisas Beneficios'!$C42*'Proyecciones Base'!I22*'Proyecciones Base'!I12,0)/1000000","v":0},{"$f":"IF('Acciones a Ejecutar'!$B42=\"si\",'Premisas Beneficios'!$C42*'Proyecciones Base'!J22*'Proyecciones Base'!J12,0)/1000000","v":0},{"$f":"IF('Acciones a Ejecutar'!$B42=\"si\",'Premisas Beneficios'!$C42*'Proyecciones Base'!K22*'Proyecciones Base'!K12,0)/1000000","v":0},{"$f":"IF('Acciones a Ejecutar'!$B42=\"si\",'Premisas Beneficios'!$C42*'Proyecciones Base'!L22*'Proyecciones Base'!L12,0)/1000000","v":0},{"$f":"IF('Acciones a Ejecutar'!$B42=\"si\",'Premisas Beneficios'!$C42*'Proyecciones Base'!M22*'Proyecciones Base'!M12,0)/1000000","v":0},{"$f":"IF('Acciones a Ejecutar'!$B42=\"si\",'Premisas Beneficios'!$C42*'Proyecciones Base'!N22*'Proyecciones Base'!N12,0)/1000000","v":0},{"$f":"IF('Acciones a Ejecutar'!$B42=\"si\",'Premisas Beneficios'!$C42*'Proyecciones Base'!O22*'Proyecciones Base'!O12,0)/1000000","v":0},{"$f":"IF('Acciones a Ejecutar'!$B42=\"si\",'Premisas Beneficios'!$C42*'Proyecciones Base'!P22*'Proyecciones Base'!P12,0)/1000000","v":0},{"$f":"IF('Acciones a Ejecutar'!$B42=\"si\",'Premisas Beneficios'!$C42*'Proyecciones Base'!Q22*'Proyecciones Base'!Q12,0)/1000000","v":0},{"$f":"IF('Acciones a Ejecutar'!$B42=\"si\",'Premisas Beneficios'!$C42*'Proyecciones Base'!R22*'Proyecciones Base'!R12,0)/1000000","v":0},{"$f":"IF('Acciones a Ejecutar'!$B42=\"si\",'Premisas Beneficios'!$C42*'Proyecciones Base'!S22*'Proyecciones Base'!S12,0)/1000000","v":0},{"$f":"IF('Acciones a Ejecutar'!$B42=\"si\",'Premisas Beneficios'!$C42*'Proyecciones Base'!T22*'Proyecciones Base'!T12,0)/1000000","v":0},{"$f":"IF('Acciones a Ejecutar'!$B42=\"si\",'Premisas Beneficios'!$C42*'Proyecciones Base'!U22*'Proyecciones Base'!U12,0)/1000000","v":0},{"$f":"IF('Acciones a Ejecutar'!$B42=\"si\",'Premisas Beneficios'!$C42*'Proyecciones Base'!V22*'Proyecciones Base'!V12,0)/1000000","v":0},null,{"$f":"+C156*Evaluacion!O43","v":0},{"$f":"+D156*Evaluacion!P43","v":0},{"$f":"+E156*Evaluacion!Q43","v":0},{"$f":"+F156*Evaluacion!R43","v":0},{"$f":"+G156*Evaluacion!S43","v":0}]
[null,"Optimización hidráulica: sectorización de la red de distribución, control de presión, optimización de la capacidad de almacenamiento.",{"$f":"IFERROR(IF('Acciones a Ejecutar'!$B43=\"si\",('Proyecciones Base'!C$26/'Proyecciones Base'!$C$28-'Proyecciones Base'!C$26/('Proyecciones Base'!$C$28))*'Datos basicos'!$B18/1000000,0),0)","v":0},{"$f":"IFERROR(IF('Acciones a Ejecutar'!$B43=\"si\",('Proyecciones Base'!D$26/'Proyecciones Base'!$C$28-'Proyecciones Base'!D$26/('Proyecciones Base'!$C$28+'Premisas Beneficios'!$C43))*'Datos basicos'!$B$18/1000000,0),0)+IF('Acciones a Ejecutar'!$B43=\"si\",'Premisas Beneficios'!$C$43*'Datos basicos'!$B$19*'Datos basicos'!$B$20,0)/1000000","v":0},{"$f":"IFERROR(IF('Acciones a Ejecutar'!$B43=\"si\",('Proyecciones Base'!E$26/'Proyecciones Base'!$C$28-'Proyecciones Base'!E$26/('Proyecciones Base'!$C$28+'Premisas Beneficios'!$C43))*'Datos basicos'!$B$18/1000000,0),0)","v":0},{"$f":"IFERROR(IF('Acciones a Ejecutar'!$B43=\"si\",('Proyecciones Base'!F$26/'Proyecciones Base'!$C$28-'Proyecciones Base'!F$26/('Proyecciones Base'!$C$28+'Premisas Beneficios'!$C43))*'Datos basicos'!$B$18/1000000,0),0)","v":0},{"$f":"IFERROR(IF('Acciones a Ejecutar'!$B43=\"si\",('Proyecciones Base'!G$26/'Proyecciones Base'!$C$28-'Proyecciones Base'!G$26/('Proyecciones Base'!$C$28+'Premisas Beneficios'!$C43))*'Datos basicos'!$B$18/1000000,0),0)","v":0},{"$f":"IFERROR(IF('Acciones a Ejecutar'!$B43=\"si\",('Proyecciones Base'!H$26/'Proyecciones Base'!$C$28-'Proyecciones Base'!H$26/('Proyecciones Base'!$C$28+'Premisas Beneficios'!$C43))*'Datos basicos'!$B$18/1000000,0),0)","v":0},{"$f":"IFERROR(IF('Acciones a Ejecutar'!$B43=\"si\",('Proyecciones Base'!I$26/'Proyecciones Base'!$C$28-'Proyecciones Base'!I$26/('Proyecciones Base'!$C$28+'Premisas Beneficios'!$C43))*'Datos basicos'!$B$18/1000000,0),0)","v":0},{"$f":"IFERROR(IF('Acciones a Ejecutar'!$B43=\"si\",('Proyecciones Base'!J$26/'Proyecciones Base'!$C$28-'Proyecciones Base'!J$26/('Proyecciones Base'!$C$28+'Premisas Beneficios'!$C43))*'Datos basicos'!$B$18/1000000,0),0)","v":0},{"$f":"IFERROR(IF('Acciones a Ejecutar'!$B43=\"si\",('Proyecciones Base'!K$26/'Proyecciones Base'!$C$28-'Proyecciones Base'!K$26/('Proyecciones Base'!$C$28+'Premisas Beneficios'!$C43))*'Datos basicos'!$B$18/1000000,0),0)","v":0},{"$f":"IFERROR(IF('Acciones a Ejecutar'!$B43=\"si\",('Proyecciones Base'!L$26/'Proyecciones Base'!$C$28-'Proyecciones Base'!L$26/('Proyecciones Base'!$C$28+'Premisas Beneficios'!$C43))*'Datos basicos'!$B$18/1000000,0),0)","v":0},{"$f":"IFERROR(IF('Acciones a Ejecutar'!$B43=\"si\",('Proyecciones Base'!M$26/'Proyecciones Base'!$C$28-'Proyecciones Base'!M$26/('Proyecciones Base'!$C$28+'Premisas Beneficios'!$C43))*'Datos basicos'!$B$18/1000000,0),0)","v":0},{"$f":"IFERROR(IF('Acciones a Ejecutar'!$B43=\"si\",('Proyecciones Base'!N$26/'Proyecciones Base'!$C$28-'Proyecciones Base'!N$26/('Proyecciones Base'!$C$28+'Premisas Beneficios'!$C43))*'Datos basicos'!$B$18/1000000,0),0)","v":0},{"$f":"IFERROR(IF('Acciones a Ejecutar'!$B43=\"si\",('Proyecciones Base'!O$26/'Proyecciones Base'!$C$28-'Proyecciones Base'!O$26/('Proyecciones Base'!$C$28+'Premisas Beneficios'!$C43))*'Datos basicos'!$B$18/1000000,0),0)","v":0},{"$f":"IFERROR(IF('Acciones a Ejecutar'!$B43=\"si\",('Proyecciones Base'!P$26/'Proyecciones Base'!$C$28-'Proyecciones Base'!P$26/('Proyecciones Base'!$C$28+'Premisas Beneficios'!$C43))*'Datos basicos'!$B$18/1000000,0),0)","v":0},{"$f":"IFERROR(IF('Acciones a Ejecutar'!$B43=\"si\",('Proyecciones Base'!Q$26/'Proyecciones Base'!$C$28-'Proyecciones Base'!Q$26/('Proyecciones Base'!$C$28+'Premisas Beneficios'!$C43))*'Datos basicos'!$B$18/1000000,0),0)","v":0},{"$f":"IFERROR(IF('Acciones a Ejecutar'!$B43=\"si\",('Proyecciones Base'!R$26/'Proyecciones Base'!$C$28-'Proyecciones Base'!R$26/('Proyecciones Base'!$C$28+'Premisas Beneficios'!$C43))*'Datos basicos'!$B$18/1000000,0),0)","v":0},{"$f":"IFERROR(IF('Acciones a Ejecutar'!$B43=\"si\",('Proyecciones Base'!S$26/'Proyecciones Base'!$C$28-'Proyecciones Base'!S$26/('Proyecciones Base'!$C$28+'Premisas Beneficios'!$C43))*'Datos basicos'!$B$18/1000000,0),0)","v":0},{"$f":"IFERROR(IF('Acciones a Ejecutar'!$B43=\"si\",('Proyecciones Base'!T$26/'Proyecciones Base'!$C$28-'Proyecciones Base'!T$26/('Proyecciones Base'!$C$28+'Premisas Beneficios'!$C43))*'Datos basicos'!$B$18/1000000,0),0)","v":0},{"$f":"IFERROR(IF('Acciones a Ejecutar'!$B43=\"si\",('Proyecciones Base'!U$26/'Proyecciones Base'!$C$28-'Proyecciones Base'!U$26/('Proyecciones Base'!$C$28+'Premisas Beneficios'!$C43))*'Datos basicos'!$B$18/1000000,0),0)","v":0},{"$f":"IFERROR(IF('Acciones a Ejecutar'!$B43=\"si\",('Proyecciones Base'!V$26/'Proyecciones Base'!$C$28-'Proyecciones Base'!V$26/('Proyecciones Base'!$C$28+'Premisas Beneficios'!$C43))*'Datos basicos'!$B$18/1000000,0),0)","v":0},null,{"$f":"+C157*Evaluacion!O44","v":0},{"$f":"+D157*Evaluacion!P44","v":0},{"$f":"+E157*Evaluacion!Q44","v":0},{"$f":"+F157*Evaluacion!R44","v":0},{"$f":"+G157*Evaluacion!S44","v":0}]
[null,"Catastro de infraestructura hidráulica y de redes",{"$f":"IFERROR(IF('Acciones a Ejecutar'!$B44=\"si\",('Proyecciones Base'!C$26/'Proyecciones Base'!$C$28-'Proyecciones Base'!C$26/('Proyecciones Base'!$C$28))*'Datos basicos'!$B18/1000000,0),0)","v":0},{"$f":"IFERROR(IF('Acciones a Ejecutar'!$B44=\"si\",('Proyecciones Base'!D$26/'Proyecciones Base'!$C$28-'Proyecciones Base'!D$26/('Proyecciones Base'!$C$28+'Premisas Beneficios'!$C44))*'Datos basicos'!$B$18/1000000,0),0)+IF('Acciones a Ejecutar'!$B44=\"si\",'Premisas Beneficios'!$C$43*'Datos basicos'!$B$19*'Datos basicos'!$B$20,0)/1000000","v":0},{"$f":"IFERROR(IF('Acciones a Ejecutar'!$B44=\"si\",('Proyecciones Base'!E$26/'Proyecciones Base'!$C$28-'Proyecciones Base'!E$26/('Proyecciones Base'!$C$28+'Premisas Beneficios'!$C44))*'Datos basicos'!$B$18/1000000,0),0)","v":0},{"$f":"IFERROR(IF('Acciones a Ejecutar'!$B44=\"si\",('Proyecciones Base'!F$26/'Proyecciones Base'!$C$28-'Proyecciones Base'!F$26/('Proyecciones Base'!$C$28+'Premisas Beneficios'!$C44))*'Datos basicos'!$B$18/1000000,0),0)","v":0},{"$f":"IFERROR(IF('Acciones a Ejecutar'!$B44=\"si\",('Proyecciones Base'!G$26/'Proyecciones Base'!$C$28-'Proyecciones Base'!G$26/('Proyecciones Base'!$C$28+'Premisas Beneficios'!$C44))*'Datos basicos'!$B$18/1000000,0),0)","v":0},{"$f":"IFERROR(IF('Acciones a Ejecutar'!$B44=\"si\",('Proyecciones Base'!H$26/'Proyecciones Base'!$C$28-'Proyecciones Base'!H$26/('Proyecciones Base'!$C$28+'Premisas Beneficios'!$C44))*'Datos basicos'!$B$18/1000000,0),0)","v":0},{"$f":"IFERROR(IF('Acciones a Ejecutar'!$B44=\"si\",('Proyecciones Base'!I$26/'Proyecciones Base'!$C$28-'Proyecciones Base'!I$26/('Proyecciones Base'!$C$28+'Premisas Beneficios'!$C44))*'Datos basicos'!$B$18/1000000,0),0)","v":0},{"$f":"IFERROR(IF('Acciones a Ejecutar'!$B44=\"si\",('Proyecciones Base'!J$26/'Proyecciones Base'!$C$28-'Proyecciones Base'!J$26/('Proyecciones Base'!$C$28+'Premisas Beneficios'!$C44))*'Datos basicos'!$B$18/1000000,0),0)","v":0},{"$f":"IFERROR(IF('Acciones a Ejecutar'!$B44=\"si\",('Proyecciones Base'!K$26/'Proyecciones Base'!$C$28-'Proyecciones Base'!K$26/('Proyecciones Base'!$C$28+'Premisas Beneficios'!$C44))*'Datos basicos'!$B$18/1000000,0),0)","v":0},{"$f":"IFERROR(IF('Acciones a Ejecutar'!$B44=\"si\",('Proyecciones Base'!L$26/'Proyecciones Base'!$C$28-'Proyecciones Base'!L$26/('Proyecciones Base'!$C$28+'Premisas Beneficios'!$C44))*'Datos basicos'!$B$18/1000000,0),0)","v":0},{"$f":"IFERROR(IF('Acciones a Ejecutar'!$B44=\"si\",('Proyecciones Base'!M$26/'Proyecciones Base'!$C$28-'Proyecciones Base'!M$26/('Proyecciones Base'!$C$28+'Premisas Beneficios'!$C44))*'Datos basicos'!$B$18/1000000,0),0)","v":0},{"$f":"IFERROR(IF('Acciones a Ejecutar'!$B44=\"si\",('Proyecciones Base'!N$26/'Proyecciones Base'!$C$28-'Proyecciones Base'!N$26/('Proyecciones Base'!$C$28+'Premisas Beneficios'!$C44))*'Datos basicos'!$B$18/1000000,0),0)","v":0},{"$f":"IFERROR(IF('Acciones a Ejecutar'!$B44=\"si\",('Proyecciones Base'!O$26/'Proyecciones Base'!$C$28-'Proyecciones Base'!O$26/('Proyecciones Base'!$C$28+'Premisas Beneficios'!$C44))*'Datos basicos'!$B$18/1000000,0),0)","v":0},{"$f":"IFERROR(IF('Acciones a Ejecutar'!$B44=\"si\",('Proyecciones Base'!P$26/'Proyecciones Base'!$C$28-'Proyecciones Base'!P$26/('Proyecciones Base'!$C$28+'Premisas Beneficios'!$C44))*'Datos basicos'!$B$18/1000000,0),0)","v":0},{"$f":"IFERROR(IF('Acciones a Ejecutar'!$B44=\"si\",('Proyecciones Base'!Q$26/'Proyecciones Base'!$C$28-'Proyecciones Base'!Q$26/('Proyecciones Base'!$C$28+'Premisas Beneficios'!$C44))*'Datos basicos'!$B$18/1000000,0),0)","v":0},{"$f":"IFERROR(IF('Acciones a Ejecutar'!$B44=\"si\",('Proyecciones Base'!R$26/'Proyecciones Base'!$C$28-'Proyecciones Base'!R$26/('Proyecciones Base'!$C$28+'Premisas Beneficios'!$C44))*'Datos basicos'!$B$18/1000000,0),0)","v":0},{"$f":"IFERROR(IF('Acciones a Ejecutar'!$B44=\"si\",('Proyecciones Base'!S$26/'Proyecciones Base'!$C$28-'Proyecciones Base'!S$26/('Proyecciones Base'!$C$28+'Premisas Beneficios'!$C44))*'Datos basicos'!$B$18/1000000,0),0)","v":0},{"$f":"IFERROR(IF('Acciones a Ejecutar'!$B44=\"si\",('Proyecciones Base'!T$26/'Proyecciones Base'!$C$28-'Proyecciones Base'!T$26/('Proyecciones Base'!$C$28+'Premisas Beneficios'!$C44))*'Datos basicos'!$B$18/1000000,0),0)","v":0},{"$f":"IFERROR(IF('Acciones a Ejecutar'!$B44=\"si\",('Proyecciones Base'!U$26/'Proyecciones Base'!$C$28-'Proyecciones Base'!U$26/('Proyecciones Base'!$C$28+'Premisas Beneficios'!$C44))*'Datos basicos'!$B$18/1000000,0),0)","v":0},{"$f":"IFERROR(IF('Acciones a Ejecutar'!$B44=\"si\",('Proyecciones Base'!V$26/'Proyecciones Base'!$C$28-'Proyecciones Base'!V$26/('Proyecciones Base'!$C$28+'Premisas Beneficios'!$C44))*'Datos basicos'!$B$18/1000000,0),0)","v":0},null,{"$f":"+C158*Evaluacion!O45","v":0},{"$f":"+D158*Evaluacion!P45","v":0},{"$f":"+E158*Evaluacion!Q45","v":0},{"$f":"+F158*Evaluacion!R45","v":0},{"$f":"+G158*Evaluacion!S45","v":0}]
[null,"Instalación de macromedidores en captaciones",{"$f":"IFERROR(IF('Acciones a Ejecutar'!$B45=\"si\",('Proyecciones Base'!C$26/'Proyecciones Base'!$C$28-'Proyecciones Base'!C$26/('Proyecciones Base'!$C$28))*'Datos basicos'!$B18/1000000,0),0)","v":0},{"$f":"IFERROR(IF('Acciones a Ejecutar'!$B45=\"si\",('Proyecciones Base'!D$26/'Proyecciones Base'!$C$28-'Proyecciones Base'!D$26/('Proyecciones Base'!$C$28+'Premisas Beneficios'!$C45))*'Datos basicos'!$B$18/1000000,0),0)+IF('Acciones a Ejecutar'!$B45=\"si\",'Premisas Beneficios'!$C$43*'Datos basicos'!$B$19*'Datos basicos'!$B$20,0)/1000000","v":0},{"$f":"IFERROR(IF('Acciones a Ejecutar'!$B45=\"si\",('Proyecciones Base'!E$26/'Proyecciones Base'!$C$28-'Proyecciones Base'!E$26/('Proyecciones Base'!$C$28+'Premisas Beneficios'!$C45))*'Datos basicos'!$B$18/1000000,0),0)","v":0},{"$f":"IFERROR(IF('Acciones a Ejecutar'!$B45=\"si\",('Proyecciones Base'!F$26/'Proyecciones Base'!$C$28-'Proyecciones Base'!F$26/('Proyecciones Base'!$C$28+'Premisas Beneficios'!$C45))*'Datos basicos'!$B$18/1000000,0),0)","v":0},{"$f":"IFERROR(IF('Acciones a Ejecutar'!$B45=\"si\",('Proyecciones Base'!G$26/'Proyecciones Base'!$C$28-'Proyecciones Base'!G$26/('Proyecciones Base'!$C$28+'Premisas Beneficios'!$C45))*'Datos basicos'!$B$18/1000000,0),0)","v":0},{"$f":"IFERROR(IF('Acciones a Ejecutar'!$B45=\"si\",('Proyecciones Base'!H$26/'Proyecciones Base'!$C$28-'Proyecciones Base'!H$26/('Proyecciones Base'!$C$28+'Premisas Beneficios'!$C45))*'Datos basicos'!$B$18/1000000,0),0)","v":0},{"$f":"IFERROR(IF('Acciones a Ejecutar'!$B45=\"si\",('Proyecciones Base'!I$26/'Proyecciones Base'!$C$28-'Proyecciones Base'!I$26/('Proyecciones Base'!$C$28+'Premisas Beneficios'!$C45))*'Datos basicos'!$B$18/1000000,0),0)","v":0},{"$f":"IFERROR(IF('Acciones a Ejecutar'!$B45=\"si\",('Proyecciones Base'!J$26/'Proyecciones Base'!$C$28-'Proyecciones Base'!J$26/('Proyecciones Base'!$C$28+'Premisas Beneficios'!$C45))*'Datos basicos'!$B$18/1000000,0),0)","v":0},{"$f":"IFERROR(IF('Acciones a Ejecutar'!$B45=\"si\",('Proyecciones Base'!K$26/'Proyecciones Base'!$C$28-'Proyecciones Base'!K$26/('Proyecciones Base'!$C$28+'Premisas Beneficios'!$C45))*'Datos basicos'!$B$18/1000000,0),0)","v":0},{"$f":"IFERROR(IF('Acciones a Ejecutar'!$B45=\"si\",('Proyecciones Base'!L$26/'Proyecciones Base'!$C$28-'Proyecciones Base'!L$26/('Proyecciones Base'!$C$28+'Premisas Beneficios'!$C45))*'Datos basicos'!$B$18/1000000,0),0)","v":0},{"$f":"IFERROR(IF('Acciones a Ejecutar'!$B45=\"si\",('Proyecciones Base'!M$26/'Proyecciones Base'!$C$28-'Proyecciones Base'!M$26/('Proyecciones Base'!$C$28+'Premisas Beneficios'!$C45))*'Datos basicos'!$B$18/1000000,0),0)","v":0},{"$f":"IFERROR(IF('Acciones a Ejecutar'!$B45=\"si\",('Proyecciones Base'!N$26/'Proyecciones Base'!$C$28-'Proyecciones Base'!N$26/('Proyecciones Base'!$C$28+'Premisas Beneficios'!$C45))*'Datos basicos'!$B$18/1000000,0),0)","v":0},{"$f":"IFERROR(IF('Acciones a Ejecutar'!$B45=\"si\",('Proyecciones Base'!O$26/'Proyecciones Base'!$C$28-'Proyecciones Base'!O$26/('Proyecciones Base'!$C$28+'Premisas Beneficios'!$C45))*'Datos basicos'!$B$18/1000000,0),0)","v":0},{"$f":"IFERROR(IF('Acciones a Ejecutar'!$B45=\"si\",('Proyecciones Base'!P$26/'Proyecciones Base'!$C$28-'Proyecciones Base'!P$26/('Proyecciones Base'!$C$28+'Premisas Beneficios'!$C45))*'Datos basicos'!$B$18/1000000,0),0)","v":0},{"$f":"IFERROR(IF('Acciones a Ejecutar'!$B45=\"si\",('Proyecciones Base'!Q$26/'Proyecciones Base'!$C$28-'Proyecciones Base'!Q$26/('Proyecciones Base'!$C$28+'Premisas Beneficios'!$C45))*'Datos basicos'!$B$18/1000000,0),0)","v":0},{"$f":"IFERROR(IF('Acciones a Ejecutar'!$B45=\"si\",('Proyecciones Base'!R$26/'Proyecciones Base'!$C$28-'Proyecciones Base'!R$26/('Proyecciones Base'!$C$28+'Premisas Beneficios'!$C45))*'Datos basicos'!$B$18/1000000,0),0)","v":0},{"$f":"IFERROR(IF('Acciones a Ejecutar'!$B45=\"si\",('Proyecciones Base'!S$26/'Proyecciones Base'!$C$28-'Proyecciones Base'!S$26/('Proyecciones Base'!$C$28+'Premisas Beneficios'!$C45))*'Datos basicos'!$B$18/1000000,0),0)","v":0},{"$f":"IFERROR(IF('Acciones a Ejecutar'!$B45=\"si\",('Proyecciones Base'!T$26/'Proyecciones Base'!$C$28-'Proyecciones Base'!T$26/('Proyecciones Base'!$C$28+'Premisas Beneficios'!$C45))*'Datos basicos'!$B$18/1000000,0),0)","v":0},{"$f":"IFERROR(IF('Acciones a Ejecutar'!$B45=\"si\",('Proyecciones Base'!U$26/'Proyecciones Base'!$C$28-'Proyecciones Base'!U$26/('Proyecciones Base'!$C$28+'Premisas Beneficios'!$C45))*'Datos basicos'!$B$18/1000000,0),0)","v":0},{"$f":"IFERROR(IF('Acciones a Ejecutar'!$B45=\"si\",('Proyecciones Base'!V$26/'Proyecciones Base'!$C$28-'Proyecciones Base'!V$26/('Proyecciones Base'!$C$28+'Premisas Beneficios'!$C45))*'Datos basicos'!$B$18/1000000,0),0)","v":0},null,{"$f":"+C159*Evaluacion!O46","v":0},{"$f":"+D159*Evaluacion!P46","v":0},{"$f":"+E159*Evaluacion!Q46","v":0},{"$f":"+F159*Evaluacion!R46","v":0},{"$f":"+G159*Evaluacion!S46","v":0}]
[null,"Instalación de macromedidores en sectores",{"$f":"IFERROR(IF('Acciones a Ejecutar'!$B46=\"si\",('Proyecciones Base'!C$26/'Proyecciones Base'!$C$28-'Proyecciones Base'!C$26/('Proyecciones Base'!$C$28))*'Datos basicos'!$B18/1000000,0),0)","v":0},{"$f":"IFERROR(IF('Acciones a Ejecutar'!$B46=\"si\",('Proyecciones Base'!D$26/'Proyecciones Base'!$C$28-'Proyecciones Base'!D$26/('Proyecciones Base'!$C$28+'Premisas Beneficios'!$C46))*'Datos basicos'!$B$18/1000000,0),0)+IF('Acciones a Ejecutar'!$B46=\"si\",'Premisas Beneficios'!$C$43*'Datos basicos'!$B$19*'Datos basicos'!$B$20,0)/1000000","v":0},{"$f":"IFERROR(IF('Acciones a Ejecutar'!$B46=\"si\",('Proyecciones Base'!E$26/'Proyecciones Base'!$C$28-'Proyecciones Base'!E$26/('Proyecciones Base'!$C$28+'Premisas Beneficios'!$C46))*'Datos basicos'!$B$18/1000000,0),0)","v":0},{"$f":"IFERROR(IF('Acciones a Ejecutar'!$B46=\"si\",('Proyecciones Base'!F$26/'Proyecciones Base'!$C$28-'Proyecciones Base'!F$26/('Proyecciones Base'!$C$28+'Premisas Beneficios'!$C46))*'Datos basicos'!$B$18/1000000,0),0)","v":0},{"$f":"IFERROR(IF('Acciones a Ejecutar'!$B46=\"si\",('Proyecciones Base'!G$26/'Proyecciones Base'!$C$28-'Proyecciones Base'!G$26/('Proyecciones Base'!$C$28+'Premisas Beneficios'!$C46))*'Datos basicos'!$B$18/1000000,0),0)","v":0},{"$f":"IFERROR(IF('Acciones a Ejecutar'!$B46=\"si\",('Proyecciones Base'!H$26/'Proyecciones Base'!$C$28-'Proyecciones Base'!H$26/('Proyecciones Base'!$C$28+'Premisas Beneficios'!$C46))*'Datos basicos'!$B$18/1000000,0),0)","v":0},{"$f":"IFERROR(IF('Acciones a Ejecutar'!$B46=\"si\",('Proyecciones Base'!I$26/'Proyecciones Base'!$C$28-'Proyecciones Base'!I$26/('Proyecciones Base'!$C$28+'Premisas Beneficios'!$C46))*'Datos basicos'!$B$18/1000000,0),0)","v":0},{"$f":"IFERROR(IF('Acciones a Ejecutar'!$B46=\"si\",('Proyecciones Base'!J$26/'Proyecciones Base'!$C$28-'Proyecciones Base'!J$26/('Proyecciones Base'!$C$28+'Premisas Beneficios'!$C46))*'Datos basicos'!$B$18/1000000,0),0)","v":0},{"$f":"IFERROR(IF('Acciones a Ejecutar'!$B46=\"si\",('Proyecciones Base'!K$26/'Proyecciones Base'!$C$28-'Proyecciones Base'!K$26/('Proyecciones Base'!$C$28+'Premisas Beneficios'!$C46))*'Datos basicos'!$B$18/1000000,0),0)","v":0},{"$f":"IFERROR(IF('Acciones a Ejecutar'!$B46=\"si\",('Proyecciones Base'!L$26/'Proyecciones Base'!$C$28-'Proyecciones Base'!L$26/('Proyecciones Base'!$C$28+'Premisas Beneficios'!$C46))*'Datos basicos'!$B$18/1000000,0),0)","v":0},{"$f":"IFERROR(IF('Acciones a Ejecutar'!$B46=\"si\",('Proyecciones Base'!M$26/'Proyecciones Base'!$C$28-'Proyecciones Base'!M$26/('Proyecciones Base'!$C$28+'Premisas Beneficios'!$C46))*'Datos basicos'!$B$18/1000000,0),0)","v":0},{"$f":"IFERROR(IF('Acciones a Ejecutar'!$B46=\"si\",('Proyecciones Base'!N$26/'Proyecciones Base'!$C$28-'Proyecciones Base'!N$26/('Proyecciones Base'!$C$28+'Premisas Beneficios'!$C46))*'Datos basicos'!$B$18/1000000,0),0)","v":0},{"$f":"IFERROR(IF('Acciones a Ejecutar'!$B46=\"si\",('Proyecciones Base'!O$26/'Proyecciones Base'!$C$28-'Proyecciones Base'!O$26/('Proyecciones Base'!$C$28+'Premisas Beneficios'!$C46))*'Datos basicos'!$B$18/1000000,0),0)","v":0},{"$f":"IFERROR(IF('Acciones a Ejecutar'!$B46=\"si\",('Proyecciones Base'!P$26/'Proyecciones Base'!$C$28-'Proyecciones Base'!P$26/('Proyecciones Base'!$C$28+'Premisas Beneficios'!$C46))*'Datos basicos'!$B$18/1000000,0),0)","v":0},{"$f":"IFERROR(IF('Acciones a Ejecutar'!$B46=\"si\",('Proyecciones Base'!Q$26/'Proyecciones Base'!$C$28-'Proyecciones Base'!Q$26/('Proyecciones Base'!$C$28+'Premisas Beneficios'!$C46))*'Datos basicos'!$B$18/1000000,0),0)","v":0},{"$f":"IFERROR(IF('Acciones a Ejecutar'!$B46=\"si\",('Proyecciones Base'!R$26/'Proyecciones Base'!$C$28-'Proyecciones Base'!R$26/('Proyecciones Base'!$C$28+'Premisas Beneficios'!$C46))*'Datos basicos'!$B$18/1000000,0),0)","v":0},{"$f":"IFERROR(IF('Acciones a Ejecutar'!$B46=\"si\",('Proyecciones Base'!S$26/'Proyecciones Base'!$C$28-'Proyecciones Base'!S$26/('Proyecciones Base'!$C$28+'Premisas Beneficios'!$C46))*'Datos basicos'!$B$18/1000000,0),0)","v":0},{"$f":"IFERROR(IF('Acciones a Ejecutar'!$B46=\"si\",('Proyecciones Base'!T$26/'Proyecciones Base'!$C$28-'Proyecciones Base'!T$26/('Proyecciones Base'!$C$28+'Premisas Beneficios'!$C46))*'Datos basicos'!$B$18/1000000,0),0)","v":0},{"$f":"IFERROR(IF('Acciones a Ejecutar'!$B46=\"si\",('Proyecciones Base'!U$26/'Proyecciones Base'!$C$28-'Proyecciones Base'!U$26/('Proyecciones Base'!$C$28+'Premisas Beneficios'!$C46))*'Datos basicos'!$B$18/1000000,0),0)","v":0},{"$f":"IFERROR(IF('Acciones a Ejecutar'!$B46=\"si\",('Proyecciones Base'!V$26/'Proyecciones Base'!$C$28-'Proyecciones Base'!V$26/('Proyecciones Base'!$C$28+'Premisas Beneficios'!$C46))*'Datos basicos'!$B$18/1000000,0),0)","v":0},null,{"$f":"+C160*Evaluacion!O47","v":0},{"$f":"+D160*Evaluacion!P47","v":0},{"$f":"+E160*Evaluacion!Q47","v":0},{"$f":"+F160*Evaluacion!R47","v":0},{"$f":"+G160*Evaluacion!S47","v":0}]
[null,"Sistematización de lectura de macromedidores en captaciones y sectores ( p.ej. a través de telemetría)",{"$f":"IFERROR(IF('Acciones a Ejecutar'!$B47=\"si\",('Proyecciones Base'!C$26/'Proyecciones Base'!$C$28-'Proyecciones Base'!C$26/('Proyecciones Base'!$C$28))*'Datos basicos'!$B18/1000000,0),0)","v":0},{"$f":"IFERROR(IF('Acciones a Ejecutar'!$B47=\"si\",('Proyecciones Base'!D$26/'Proyecciones Base'!$C$28-'Proyecciones Base'!D$26/('Proyecciones Base'!$C$28+'Premisas Beneficios'!$C47))*'Datos basicos'!$B$18/1000000,0),0)+IF('Acciones a Ejecutar'!$B47=\"si\",'Premisas Beneficios'!$C$43*'Datos basicos'!$B$19*'Datos basicos'!$B$20,0)/1000000","v":0},{"$f":"IFERROR(IF('Acciones a Ejecutar'!$B47=\"si\",('Proyecciones Base'!E$26/'Proyecciones Base'!$C$28-'Proyecciones Base'!E$26/('Proyecciones Base'!$C$28+'Premisas Beneficios'!$C47))*'Datos basicos'!$B$18/1000000,0),0)","v":0},{"$f":"IFERROR(IF('Acciones a Ejecutar'!$B47=\"si\",('Proyecciones Base'!F$26/'Proyecciones Base'!$C$28-'Proyecciones Base'!F$26/('Proyecciones Base'!$C$28+'Premisas Beneficios'!$C47))*'Datos basicos'!$B$18/1000000,0),0)","v":0},{"$f":"IFERROR(IF('Acciones a Ejecutar'!$B47=\"si\",('Proyecciones Base'!G$26/'Proyecciones Base'!$C$28-'Proyecciones Base'!G$26/('Proyecciones Base'!$C$28+'Premisas Beneficios'!$C47))*'Datos basicos'!$B$18/1000000,0),0)","v":0},{"$f":"IFERROR(IF('Acciones a Ejecutar'!$B47=\"si\",('Proyecciones Base'!H$26/'Proyecciones Base'!$C$28-'Proyecciones Base'!H$26/('Proyecciones Base'!$C$28+'Premisas Beneficios'!$C47))*'Datos basicos'!$B$18/1000000,0),0)","v":0},{"$f":"IFERROR(IF('Acciones a Ejecutar'!$B47=\"si\",('Proyecciones Base'!I$26/'Proyecciones Base'!$C$28-'Proyecciones Base'!I$26/('Proyecciones Base'!$C$28+'Premisas Beneficios'!$C47))*'Datos basicos'!$B$18/1000000,0),0)","v":0},{"$f":"IFERROR(IF('Acciones a Ejecutar'!$B47=\"si\",('Proyecciones Base'!J$26/'Proyecciones Base'!$C$28-'Proyecciones Base'!J$26/('Proyecciones Base'!$C$28+'Premisas Beneficios'!$C47))*'Datos basicos'!$B$18/1000000,0),0)","v":0},{"$f":"IFERROR(IF('Acciones a Ejecutar'!$B47=\"si\",('Proyecciones Base'!K$26/'Proyecciones Base'!$C$28-'Proyecciones Base'!K$26/('Proyecciones Base'!$C$28+'Premisas Beneficios'!$C47))*'Datos basicos'!$B$18/1000000,0),0)","v":0},{"$f":"IFERROR(IF('Acciones a Ejecutar'!$B47=\"si\",('Proyecciones Base'!L$26/'Proyecciones Base'!$C$28-'Proyecciones Base'!L$26/('Proyecciones Base'!$C$28+'Premisas Beneficios'!$C47))*'Datos basicos'!$B$18/1000000,0),0)","v":0},{"$f":"IFERROR(IF('Acciones a Ejecutar'!$B47=\"si\",('Proyecciones Base'!M$26/'Proyecciones Base'!$C$28-'Proyecciones Base'!M$26/('Proyecciones Base'!$C$28+'Premisas Beneficios'!$C47))*'Datos basicos'!$B$18/1000000,0),0)","v":0},{"$f":"IFERROR(IF('Acciones a Ejecutar'!$B47=\"si\",('Proyecciones Base'!N$26/'Proyecciones Base'!$C$28-'Proyecciones Base'!N$26/('Proyecciones Base'!$C$28+'Premisas Beneficios'!$C47))*'Datos basicos'!$B$18/1000000,0),0)","v":0},{"$f":"IFERROR(IF('Acciones a Ejecutar'!$B47=\"si\",('Proyecciones Base'!O$26/'Proyecciones Base'!$C$28-'Proyecciones Base'!O$26/('Proyecciones Base'!$C$28+'Premisas Beneficios'!$C47))*'Datos basicos'!$B$18/1000000,0),0)","v":0},{"$f":"IFERROR(IF('Acciones a Ejecutar'!$B47=\"si\",('Proyecciones Base'!P$26/'Proyecciones Base'!$C$28-'Proyecciones Base'!P$26/('Proyecciones Base'!$C$28+'Premisas Beneficios'!$C47))*'Datos basicos'!$B$18/1000000,0),0)","v":0},{"$f":"IFERROR(IF('Acciones a Ejecutar'!$B47=\"si\",('Proyecciones Base'!Q$26/'Proyecciones Base'!$C$28-'Proyecciones Base'!Q$26/('Proyecciones Base'!$C$28+'Premisas Beneficios'!$C47))*'Datos basicos'!$B$18/1000000,0),0)","v":0},{"$f":"IFERROR(IF('Acciones a Ejecutar'!$B47=\"si\",('Proyecciones Base'!R$26/'Proyecciones Base'!$C$28-'Proyecciones Base'!R$26/('Proyecciones Base'!$C$28+'Premisas Beneficios'!$C47))*'Datos basicos'!$B$18/1000000,0),0)","v":0},{"$f":"IFERROR(IF('Acciones a Ejecutar'!$B47=\"si\",('Proyecciones Base'!S$26/'Proyecciones Base'!$C$28-'Proyecciones Base'!S$26/('Proyecciones Base'!$C$28+'Premisas Beneficios'!$C47))*'Datos basicos'!$B$18/1000000,0),0)","v":0},{"$f":"IFERROR(IF('Acciones a Ejecutar'!$B47=\"si\",('Proyecciones Base'!T$26/'Proyecciones Base'!$C$28-'Proyecciones Base'!T$26/('Proyecciones Base'!$C$28+'Premisas Beneficios'!$C47))*'Datos basicos'!$B$18/1000000,0),0)","v":0},{"$f":"IFERROR(IF('Acciones a Ejecutar'!$B47=\"si\",('Proyecciones Base'!U$26/'Proyecciones Base'!$C$28-'Proyecciones Base'!U$26/('Proyecciones Base'!$C$28+'Premisas Beneficios'!$C47))*'Datos basicos'!$B$18/1000000,0),0)","v":0},{"$f":"IFERROR(IF('Acciones a Ejecutar'!$B47=\"si\",('Proyecciones Base'!V$26/'Proyecciones Base'!$C$28-'Proyecciones Base'!V$26/('Proyecciones Base'!$C$28+'Premisas Beneficios'!$C47))*'Datos basicos'!$B$18/1000000,0),0)","v":0},null,{"$f":"+C161*Evaluacion!O48","v":0},{"$f":"+D161*Evaluacion!P48","v":0},{"$f":"+E161*Evaluacion!Q48","v":0},{"$f":"+F161*Evaluacion!R48","v":0},{"$f":"+G161*Evaluacion!S48","v":0}]
[null,"Sustitución de tuberías con alto índice de fugas",{"$f":"IFERROR(IF('Acciones a Ejecutar'!$B48=\"si\",('Proyecciones Base'!C$26/'Proyecciones Base'!$C$28-'Proyecciones Base'!C$26/('Proyecciones Base'!$C$28))*'Datos basicos'!$B18/1000000,0),0)","v":0},{"$f":"IFERROR(IF('Acciones a Ejecutar'!$B48=\"si\",('Proyecciones Base'!D$26/'Proyecciones Base'!$C$28-'Proyecciones Base'!D$26/('Proyecciones Base'!$C$28+'Premisas Beneficios'!$C48))*'Datos basicos'!$B$18/1000000,0),0)+IF('Acciones a Ejecutar'!$B48=\"si\",'Premisas Beneficios'!$C$43*'Datos basicos'!$B$19*'Datos basicos'!$B$20,0)/1000000","v":0},{"$f":"IFERROR(IF('Acciones a Ejecutar'!$B48=\"si\",('Proyecciones Base'!E$26/'Proyecciones Base'!$C$28-'Proyecciones Base'!E$26/('Proyecciones Base'!$C$28+'Premisas Beneficios'!$C48))*'Datos basicos'!$B$18/1000000,0),0)","v":0},{"$f":"IFERROR(IF('Acciones a Ejecutar'!$B48=\"si\",('Proyecciones Base'!F$26/'Proyecciones Base'!$C$28-'Proyecciones Base'!F$26/('Proyecciones Base'!$C$28+'Premisas Beneficios'!$C48))*'Datos basicos'!$B$18/1000000,0),0)","v":0},{"$f":"IFERROR(IF('Acciones a Ejecutar'!$B48=\"si\",('Proyecciones Base'!G$26/'Proyecciones Base'!$C$28-'Proyecciones Base'!G$26/('Proyecciones Base'!$C$28+'Premisas Beneficios'!$C48))*'Datos basicos'!$B$18/1000000,0),0)","v":0},{"$f":"IFERROR(IF('Acciones a Ejecutar'!$B48=\"si\",('Proyecciones Base'!H$26/'Proyecciones Base'!$C$28-'Proyecciones Base'!H$26/('Proyecciones Base'!$C$28+'Premisas Beneficios'!$C48))*'Datos basicos'!$B$18/1000000,0),0)","v":0},{"$f":"IFERROR(IF('Acciones a Ejecutar'!$B48=\"si\",('Proyecciones Base'!I$26/'Proyecciones Base'!$C$28-'Proyecciones Base'!I$26/('Proyecciones Base'!$C$28+'Premisas Beneficios'!$C48))*'Datos basicos'!$B$18/1000000,0),0)","v":0},{"$f":"IFERROR(IF('Acciones a Ejecutar'!$B48=\"si\",('Proyecciones Base'!J$26/'Proyecciones Base'!$C$28-'Proyecciones Base'!J$26/('Proyecciones Base'!$C$28+'Premisas Beneficios'!$C48))*'Datos basicos'!$B$18/1000000,0),0)","v":0},{"$f":"IFERROR(IF('Acciones a Ejecutar'!$B48=\"si\",('Proyecciones Base'!K$26/'Proyecciones Base'!$C$28-'Proyecciones Base'!K$26/('Proyecciones Base'!$C$28+'Premisas Beneficios'!$C48))*'Datos basicos'!$B$18/1000000,0),0)","v":0},{"$f":"IFERROR(IF('Acciones a Ejecutar'!$B48=\"si\",('Proyecciones Base'!L$26/'Proyecciones Base'!$C$28-'Proyecciones Base'!L$26/('Proyecciones Base'!$C$28+'Premisas Beneficios'!$C48))*'Datos basicos'!$B$18/1000000,0),0)","v":0},{"$f":"IFERROR(IF('Acciones a Ejecutar'!$B48=\"si\",('Proyecciones Base'!M$26/'Proyecciones Base'!$C$28-'Proyecciones Base'!M$26/('Proyecciones Base'!$C$28+'Premisas Beneficios'!$C48))*'Datos basicos'!$B$18/1000000,0),0)","v":0},{"$f":"IFERROR(IF('Acciones a Ejecutar'!$B48=\"si\",('Proyecciones Base'!N$26/'Proyecciones Base'!$C$28-'Proyecciones Base'!N$26/('Proyecciones Base'!$C$28+'Premisas Beneficios'!$C48))*'Datos basicos'!$B$18/1000000,0),0)","v":0},{"$f":"IFERROR(IF('Acciones a Ejecutar'!$B48=\"si\",('Proyecciones Base'!O$26/'Proyecciones Base'!$C$28-'Proyecciones Base'!O$26/('Proyecciones Base'!$C$28+'Premisas Beneficios'!$C48))*'Datos basicos'!$B$18/1000000,0),0)","v":0},{"$f":"IFERROR(IF('Acciones a Ejecutar'!$B48=\"si\",('Proyecciones Base'!P$26/'Proyecciones Base'!$C$28-'Proyecciones Base'!P$26/('Proyecciones Base'!$C$28+'Premisas Beneficios'!$C48))*'Datos basicos'!$B$18/1000000,0),0)","v":0},{"$f":"IFERROR(IF('Acciones a Ejecutar'!$B48=\"si\",('Proyecciones Base'!Q$26/'Proyecciones Base'!$C$28-'Proyecciones Base'!Q$26/('Proyecciones Base'!$C$28+'Premisas Beneficios'!$C48))*'Datos basicos'!$B$18/1000000,0),0)","v":0},{"$f":"IFERROR(IF('Acciones a Ejecutar'!$B48=\"si\",('Proyecciones Base'!R$26/'Proyecciones Base'!$C$28-'Proyecciones Base'!R$26/('Proyecciones Base'!$C$28+'Premisas Beneficios'!$C48))*'Datos basicos'!$B$18/1000000,0),0)","v":0},{"$f":"IFERROR(IF('Acciones a Ejecutar'!$B48=\"si\",('Proyecciones Base'!S$26/'Proyecciones Base'!$C$28-'Proyecciones Base'!S$26/('Proyecciones Base'!$C$28+'Premisas Beneficios'!$C48))*'Datos basicos'!$B$18/1000000,0),0)","v":0},{"$f":"IFERROR(IF('Acciones a Ejecutar'!$B48=\"si\",('Proyecciones Base'!T$26/'Proyecciones Base'!$C$28-'Proyecciones Base'!T$26/('Proyecciones Base'!$C$28+'Premisas Beneficios'!$C48))*'Datos basicos'!$B$18/1000000,0),0)","v":0},{"$f":"IFERROR(IF('Acciones a Ejecutar'!$B48=\"si\",('Proyecciones Base'!U$26/'Proyecciones Base'!$C$28-'Proyecciones Base'!U$26/('Proyecciones Base'!$C$28+'Premisas Beneficios'!$C48))*'Datos basicos'!$B$18/1000000,0),0)","v":0},{"$f":"IFERROR(IF('Acciones a Ejecutar'!$B48=\"si\",('Proyecciones Base'!V$26/'Proyecciones Base'!$C$28-'Proyecciones Base'!V$26/('Proyecciones Base'!$C$28+'Premisas Beneficios'!$C48))*'Datos basicos'!$B$18/1000000,0),0)","v":0},null,{"$f":"+C162*Evaluacion!O49","v":0},{"$f":"+D162*Evaluacion!P49","v":0},{"$f":"+E162*Evaluacion!Q49","v":0},{"$f":"+F162*Evaluacion!R49","v":0},{"$f":"+G162*Evaluacion!S49","v":0}]
[null,"Capacitación del personal del OO en operación de equipos",{"$f":"IFERROR(IF('Acciones a Ejecutar'!$B49=\"si\",('Proyecciones Base'!C$26/'Proyecciones Base'!$C$28-'Proyecciones Base'!C$26/('Proyecciones Base'!$C$28))*'Datos basicos'!$B18/1000000,0),0)","v":0},{"$f":"IFERROR(IF('Acciones a Ejecutar'!$B49=\"si\",('Proyecciones Base'!D$26/'Proyecciones Base'!$C$28-'Proyecciones Base'!D$26/('Proyecciones Base'!$C$28+'Premisas Beneficios'!$C49))*'Datos basicos'!$B$18/1000000,0),0)+IF('Acciones a Ejecutar'!$B49=\"si\",'Premisas Beneficios'!$C$43*'Datos basicos'!$B$19*'Datos basicos'!$B$20,0)/1000000","v":0},{"$f":"IFERROR(IF('Acciones a Ejecutar'!$B49=\"si\",('Proyecciones Base'!E$26/'Proyecciones Base'!$C$28-'Proyecciones Base'!E$26/('Proyecciones Base'!$C$28+'Premisas Beneficios'!$C49))*'Datos basicos'!$B$18/1000000,0),0)","v":0},{"$f":"IFERROR(IF('Acciones a Ejecutar'!$B49=\"si\",('Proyecciones Base'!F$26/'Proyecciones Base'!$C$28-'Proyecciones Base'!F$26/('Proyecciones Base'!$C$28+'Premisas Beneficios'!$C49))*'Datos basicos'!$B$18/1000000,0),0)","v":0},{"$f":"IFERROR(IF('Acciones a Ejecutar'!$B49=\"si\",('Proyecciones Base'!G$26/'Proyecciones Base'!$C$28-'Proyecciones Base'!G$26/('Proyecciones Base'!$C$28+'Premisas Beneficios'!$C49))*'Datos basicos'!$B$18/1000000,0),0)","v":0},{"$f":"IFERROR(IF('Acciones a Ejecutar'!$B49=\"si\",('Proyecciones Base'!H$26/'Proyecciones Base'!$C$28-'Proyecciones Base'!H$26/('Proyecciones Base'!$C$28+'Premisas Beneficios'!$C49))*'Datos basicos'!$B$18/1000000,0),0)","v":0},{"$f":"IFERROR(IF('Acciones a Ejecutar'!$B49=\"si\",('Proyecciones Base'!I$26/'Proyecciones Base'!$C$28-'Proyecciones Base'!I$26/('Proyecciones Base'!$C$28+'Premisas Beneficios'!$C49))*'Datos basicos'!$B$18/1000000,0),0)","v":0},{"$f":"IFERROR(IF('Acciones a Ejecutar'!$B49=\"si\",('Proyecciones Base'!J$26/'Proyecciones Base'!$C$28-'Proyecciones Base'!J$26/('Proyecciones Base'!$C$28+'Premisas Beneficios'!$C49))*'Datos basicos'!$B$18/1000000,0),0)","v":0},{"$f":"IFERROR(IF('Acciones a Ejecutar'!$B49=\"si\",('Proyecciones Base'!K$26/'Proyecciones Base'!$C$28-'Proyecciones Base'!K$26/('Proyecciones Base'!$C$28+'Premisas Beneficios'!$C49))*'Datos basicos'!$B$18/1000000,0),0)","v":0},{"$f":"IFERROR(IF('Acciones a Ejecutar'!$B49=\"si\",('Proyecciones Base'!L$26/'Proyecciones Base'!$C$28-'Proyecciones Base'!L$26/('Proyecciones Base'!$C$28+'Premisas Beneficios'!$C49))*'Datos basicos'!$B$18/1000000,0),0)","v":0},{"$f":"IFERROR(IF('Acciones a Ejecutar'!$B49=\"si\",('Proyecciones Base'!M$26/'Proyecciones Base'!$C$28-'Proyecciones Base'!M$26/('Proyecciones Base'!$C$28+'Premisas Beneficios'!$C49))*'Datos basicos'!$B$18/1000000,0),0)","v":0},{"$f":"IFERROR(IF('Acciones a Ejecutar'!$B49=\"si\",('Proyecciones Base'!N$26/'Proyecciones Base'!$C$28-'Proyecciones Base'!N$26/('Proyecciones Base'!$C$28+'Premisas Beneficios'!$C49))*'Datos basicos'!$B$18/1000000,0),0)","v":0},{"$f":"IFERROR(IF('Acciones a Ejecutar'!$B49=\"si\",('Proyecciones Base'!O$26/'Proyecciones Base'!$C$28-'Proyecciones Base'!O$26/('Proyecciones Base'!$C$28+'Premisas Beneficios'!$C49))*'Datos basicos'!$B$18/1000000,0),0)","v":0},{"$f":"IFERROR(IF('Acciones a Ejecutar'!$B49=\"si\",('Proyecciones Base'!P$26/'Proyecciones Base'!$C$28-'Proyecciones Base'!P$26/('Proyecciones Base'!$C$28+'Premisas Beneficios'!$C49))*'Datos basicos'!$B$18/1000000,0),0)","v":0},{"$f":"IFERROR(IF('Acciones a Ejecutar'!$B49=\"si\",('Proyecciones Base'!Q$26/'Proyecciones Base'!$C$28-'Proyecciones Base'!Q$26/('Proyecciones Base'!$C$28+'Premisas Beneficios'!$C49))*'Datos basicos'!$B$18/1000000,0),0)","v":0},{"$f":"IFERROR(IF('Acciones a Ejecutar'!$B49=\"si\",('Proyecciones Base'!R$26/'Proyecciones Base'!$C$28-'Proyecciones Base'!R$26/('Proyecciones Base'!$C$28+'Premisas Beneficios'!$C49))*'Datos basicos'!$B$18/1000000,0),0)","v":0},{"$f":"IFERROR(IF('Acciones a Ejecutar'!$B49=\"si\",('Proyecciones Base'!S$26/'Proyecciones Base'!$C$28-'Proyecciones Base'!S$26/('Proyecciones Base'!$C$28+'Premisas Beneficios'!$C49))*'Datos basicos'!$B$18/1000000,0),0)","v":0},{"$f":"IFERROR(IF('Acciones a Ejecutar'!$B49=\"si\",('Proyecciones Base'!T$26/'Proyecciones Base'!$C$28-'Proyecciones Base'!T$26/('Proyecciones Base'!$C$28+'Premisas Beneficios'!$C49))*'Datos basicos'!$B$18/1000000,0),0)","v":0},{"$f":"IFERROR(IF('Acciones a Ejecutar'!$B49=\"si\",('Proyecciones Base'!U$26/'Proyecciones Base'!$C$28-'Proyecciones Base'!U$26/('Proyecciones Base'!$C$28+'Premisas Beneficios'!$C49))*'Datos basicos'!$B$18/1000000,0),0)","v":0},{"$f":"IFERROR(IF('Acciones a Ejecutar'!$B49=\"si\",('Proyecciones Base'!V$26/'Proyecciones Base'!$C$28-'Proyecciones Base'!V$26/('Proyecciones Base'!$C$28+'Premisas Beneficios'!$C49))*'Datos basicos'!$B$18/1000000,0),0)","v":0},null,{"$f":"+C163*Evaluacion!O50","v":0},{"$f":"+D163*Evaluacion!P50","v":0},{"$f":"+E163*Evaluacion!Q50","v":0},{"$f":"+F163*Evaluacion!R50","v":0},{"$f":"+G163*Evaluacion!S50","v":0}]
[null,"Sistema de Información Geográfica",{"$f":"IFERROR(IF('Acciones a Ejecutar'!$B50=\"si\",('Proyecciones Base'!C$26/'Proyecciones Base'!$C$28-'Proyecciones Base'!C$26/('Proyecciones Base'!$C$28))*'Datos basicos'!$B18/1000000,0),0)","v":0},{"$f":"IFERROR(IF('Acciones a Ejecutar'!$B50=\"si\",('Proyecciones Base'!D$26/'Proyecciones Base'!$C$28-'Proyecciones Base'!D$26/('Proyecciones Base'!$C$28+'Premisas Beneficios'!$C50))*'Datos basicos'!$B$18/1000000,0),0)+IF('Acciones a Ejecutar'!$B50=\"si\",'Premisas Beneficios'!$C$43*'Datos basicos'!$B$19*'Datos basicos'!$B$20,0)/1000000","v":0},{"$f":"IFERROR(IF('Acciones a Ejecutar'!$B50=\"si\",('Proyecciones Base'!E$26/'Proyecciones Base'!$C$28-'Proyecciones Base'!E$26/('Proyecciones Base'!$C$28+'Premisas Beneficios'!$C50))*'Datos basicos'!$B$18/1000000,0),0)","v":0},{"$f":"IFERROR(IF('Acciones a Ejecutar'!$B50=\"si\",('Proyecciones Base'!F$26/'Proyecciones Base'!$C$28-'Proyecciones Base'!F$26/('Proyecciones Base'!$C$28+'Premisas Beneficios'!$C50))*'Datos basicos'!$B$18/1000000,0),0)","v":0},{"$f":"IFERROR(IF('Acciones a Ejecutar'!$B50=\"si\",('Proyecciones Base'!G$26/'Proyecciones Base'!$C$28-'Proyecciones Base'!G$26/('Proyecciones Base'!$C$28+'Premisas Beneficios'!$C50))*'Datos basicos'!$B$18/1000000,0),0)","v":0},{"$f":"IFERROR(IF('Acciones a Ejecutar'!$B50=\"si\",('Proyecciones Base'!H$26/'Proyecciones Base'!$C$28-'Proyecciones Base'!H$26/('Proyecciones Base'!$C$28+'Premisas Beneficios'!$C50))*'Datos basicos'!$B$18/1000000,0),0)","v":0},{"$f":"IFERROR(IF('Acciones a Ejecutar'!$B50=\"si\",('Proyecciones Base'!I$26/'Proyecciones Base'!$C$28-'Proyecciones Base'!I$26/('Proyecciones Base'!$C$28+'Premisas Beneficios'!$C50))*'Datos basicos'!$B$18/1000000,0),0)","v":0},{"$f":"IFERROR(IF('Acciones a Ejecutar'!$B50=\"si\",('Proyecciones Base'!J$26/'Proyecciones Base'!$C$28-'Proyecciones Base'!J$26/('Proyecciones Base'!$C$28+'Premisas Beneficios'!$C50))*'Datos basicos'!$B$18/1000000,0),0)","v":0},{"$f":"IFERROR(IF('Acciones a Ejecutar'!$B50=\"si\",('Proyecciones Base'!K$26/'Proyecciones Base'!$C$28-'Proyecciones Base'!K$26/('Proyecciones Base'!$C$28+'Premisas Beneficios'!$C50))*'Datos basicos'!$B$18/1000000,0),0)","v":0},{"$f":"IFERROR(IF('Acciones a Ejecutar'!$B50=\"si\",('Proyecciones Base'!L$26/'Proyecciones Base'!$C$28-'Proyecciones Base'!L$26/('Proyecciones Base'!$C$28+'Premisas Beneficios'!$C50))*'Datos basicos'!$B$18/1000000,0),0)","v":0},{"$f":"IFERROR(IF('Acciones a Ejecutar'!$B50=\"si\",('Proyecciones Base'!M$26/'Proyecciones Base'!$C$28-'Proyecciones Base'!M$26/('Proyecciones Base'!$C$28+'Premisas Beneficios'!$C50))*'Datos basicos'!$B$18/1000000,0),0)","v":0},{"$f":"IFERROR(IF('Acciones a Ejecutar'!$B50=\"si\",('Proyecciones Base'!N$26/'Proyecciones Base'!$C$28-'Proyecciones Base'!N$26/('Proyecciones Base'!$C$28+'Premisas Beneficios'!$C50))*'Datos basicos'!$B$18/1000000,0),0)","v":0},{"$f":"IFERROR(IF('Acciones a Ejecutar'!$B50=\"si\",('Proyecciones Base'!O$26/'Proyecciones Base'!$C$28-'Proyecciones Base'!O$26/('Proyecciones Base'!$C$28+'Premisas Beneficios'!$C50))*'Datos basicos'!$B$18/1000000,0),0)","v":0},{"$f":"IFERROR(IF('Acciones a Ejecutar'!$B50=\"si\",('Proyecciones Base'!P$26/'Proyecciones Base'!$C$28-'Proyecciones Base'!P$26/('Proyecciones Base'!$C$28+'Premisas Beneficios'!$C50))*'Datos basicos'!$B$18/1000000,0),0)","v":0},{"$f":"IFERROR(IF('Acciones a Ejecutar'!$B50=\"si\",('Proyecciones Base'!Q$26/'Proyecciones Base'!$C$28-'Proyecciones Base'!Q$26/('Proyecciones Base'!$C$28+'Premisas Beneficios'!$C50))*'Datos basicos'!$B$18/1000000,0),0)","v":0},{"$f":"IFERROR(IF('Acciones a Ejecutar'!$B50=\"si\",('Proyecciones Base'!R$26/'Proyecciones Base'!$C$28-'Proyecciones Base'!R$26/('Proyecciones Base'!$C$28+'Premisas Beneficios'!$C50))*'Datos basicos'!$B$18/1000000,0),0)","v":0},{"$f":"IFERROR(IF('Acciones a Ejecutar'!$B50=\"si\",('Proyecciones Base'!S$26/'Proyecciones Base'!$C$28-'Proyecciones Base'!S$26/('Proyecciones Base'!$C$28+'Premisas Beneficios'!$C50))*'Datos basicos'!$B$18/1000000,0),0)","v":0},{"$f":"IFERROR(IF('Acciones a Ejecutar'!$B50=\"si\",('Proyecciones Base'!T$26/'Proyecciones Base'!$C$28-'Proyecciones Base'!T$26/('Proyecciones Base'!$C$28+'Premisas Beneficios'!$C50))*'Datos basicos'!$B$18/1000000,0),0)","v":0},{"$f":"IFERROR(IF('Acciones a Ejecutar'!$B50=\"si\",('Proyecciones Base'!U$26/'Proyecciones Base'!$C$28-'Proyecciones Base'!U$26/('Proyecciones Base'!$C$28+'Premisas Beneficios'!$C50))*'Datos basicos'!$B$18/1000000,0),0)","v":0},{"$f":"IFERROR(IF('Acciones a Ejecutar'!$B50=\"si\",('Proyecciones Base'!V$26/'Proyecciones Base'!$C$28-'Proyecciones Base'!V$26/('Proyecciones Base'!$C$28+'Premisas Beneficios'!$C50))*'Datos basicos'!$B$18/1000000,0),0)","v":0},null,{"$f":"+C164*Evaluacion!O51","v":0},{"$f":"+D164*Evaluacion!P51","v":0},{"$f":"+E164*Evaluacion!Q51","v":0},{"$f":"+F164*Evaluacion!R51","v":0},{"$f":"+G164*Evaluacion!S51","v":0}]
[null,"Total PAI de reducciòn de Pérdidas Físicas de Agua",{"$f":"SUM(C153:C164)","v":0},0,0,0,0,0,0,0,0,0,0,0,0,0,0,0,0,0,0,0,null,0,0,0,0,0]
[null,"5. PAI para sostenibilidad a las acciones "]
[null,{"$f":"+B111","v":"Establecimiento de un comité ciudadano del organismo operador"}]
[null,{"$f":"+B112","v":"Elaboración de un código de ética y suscripción por parte del personal del OO"}]
[null,{"$f":"+B113","v":"Sistema informático de contabilidad"}]
[null,{"$f":"+B114","v":"Sistema de planeación Integral"}]
[null,{"$f":"+B115","v":"Asesoría para financiamiento de contraparte"}]
[null,"Total PAI para sostenibilidad a las acciones",{"$f":"+SUM(C167:C171)","v":0},0,0,0,0,0,0,0,0,0,0,0,0,0,0,0,0,0,0,0,null,0,0,0,0,0]
[null,"Total PAIs",{"$f":"C172+C165+C151+C135+C130","v":0},0,0,0,0,0,0,0,0,0,0,0,0,0,0,0,0,0,0,0,null,0,0,0,0,0]
[]
[null,null,1,{"$f":"+C175+1","v":2},3,4,5,6,7,8,9,10,11,12,13,14,15,16,17,18,19,20]
[null,"Evaluación PAI  (Millones de pesos)",{"$f":"+C120","v":1},{"$f":"+C176+1","v":2},3,4,5,6,7,8,9,10,11,12,13,14,15,16,17,18,19,20]
[null,"1. PAI para reducir gastos de energía eléctrica"]
[null,{"$f":"+B122","v":"Solicitud de cambio de tarifa eléctrica para reducir gasto por concepto de energía eléctrica."},{"$f":"-C10","v":0},{"$f":"+D122-D66-D10","v":0},0,0,0,0,0,0,0,0,0,0,0,0,0,0,0,0,0,0]
[null,"Reducción de la potencia reactiva (reducción del factor de potencia)",0,{"$f":"+D123-D67-D11","v":0},0,0,0,0,0,0,0,0,0,0,0,0,0,0,0,0,0,0]
[null,"Sustitución de equipos de bombeo de agua potable para reducir consumo de energía",0,{"$f":"+D124-D68-D12","v":0},0,0,0,0,0,0,0,0,0,0,0,0,0,0,0,0,0,0]
[null,"Sustitución o construcción de tanques de almacenamiento de agua para modificar políticas de operación del equipo de bombeo",0,{"$f":"+D125-D69-D13","v":0},0,0,0,0,0,0,0,0,0,0,0,0,0,0,0,0,0,0]
[null,"Automatización de equipos de bombeo para modificar políticas de operación",0,{"$f":"+D126-D70-D14","v":0},0,0,0,0,0,0,0,0,0,0,0,0,0,0,0,0,0,0]
[null,"Sustitución de bombas de alcantarillado",0,{"$f":"+D127-D71-D15","v":0},0,0,0,0,0,0,0,0,0,0,0,0,0,0,0,0,0,0]
[null,"Reducción de gastos de energía en plantas de tratamiento de aguas residuales (PTAR)",0,{"$f":"+D128-D72-D16","v":0},0,0,0,0,0,0,0,0,0,0,0,0,0,0,0,0,0,0]
[null,"Elaboración de una auditoría energética",0,{"$f":"+D129-D73-D17","v":0},0,0,0,0,0,0,0,0,0,0,0,0,0,0,0,0,0,0]
[null,"Total Inversión PAI para reducción de gastos de energía eléctrica",{"$f":"+SUM(C178:C185)","v":0},0,0,0,0,0,0,0,0,0,0,0,0,0,0,0,0,0,0,0]
[null,"2. PAI para incrementar la productividad del personal "]
[null,{"$f":"+B132","v":"Programa de capacitación y profesionalización para incrementar la productividad del personal."},{"$f":"-C20","v":0},{"$f":"+D132-D76-D20","v":0},0,0,0,0,0,0,0,0,0,0,0,0,0,0,0,0,0,0]
[null,{"$f":"+B133","v":"Revisión del manual de funciones y cargos del personal del OO"},{"$f":"-C21","v":0},{"$f":"+D133-D77-D21","v":0},0,0,0,0,0,0,0,0,0,0,0,0,0,0,0,0,0,0]
[null,{"$f":"+B134","v":"Establecimiento de un programa de retiro voluntario y obligado"},{"$f":"-C22","v":0},{"$f":"+D134-D78-D22","v":0},0,0,0,0,0,0,0,0,0,0,0,0,0,0,0,0,0,0]
[null,"Total Inversión PAI para incrementar la productividad del personal",{"$f":"SUM(C188:C190)","v":0},0,0,0,0,0,0,0,0,0,0,0,0,0,0,0,0,0,0,0]
[null,"3. PAI para mejora de la Gestión Comercial"]
[null,{"$f":"+B137","v":"Ajuste de consumos de cuota fija"},{"$f":"-C25","v":0},{"$f":"+D137-D81-D25","v":0},0,0,0,0,0,0,0,0,0,0,0,0,0,0,0,0,0,0]
[null,"Corrección de errores de micromedición mediante sustitución de medidores.",0,{"$f":"+D138-D82-D26","v":0},0,0,0,0,0,0,0,0,0,0,0,0,0,0,0,0,0,0]
[null,"Impartición de cursos de formación de recursos humanos en eficiencia comercial",0,{"$f":"+D139-D83-D27","v":0},0,0,0,0,0,0,0,0,0,0,0,0,0,0,0,0,0,0]
[null,"Impartición de cursos de formación de recursos humanos en atención a usuarios",0,{"$f":"+D140-D84-D28","v":0},0,0,0,0,0,0,0,0,0,0,0,0,0,0,0,0,0,0]
[null,"Firma de convenios con bancos y otras instituciones para ampliar las opciones de pago de los servicios de agua y saneamiento",0,{"$f":"+D141-D85-D29","v":0},0,0,0,0,0,0,0,0,0,0,0,0,0,0,0,0,0,0]
[null,"Mejoras a la facturación mediante un nuevo sistema comercial",0,{"$f":"+D142-D86-D30","v":0},0,0,0,0,0,0,0,0,0,0,0,0,0,0,0,0,0,0]
[null,"Mejoras en la cobranza mediante esquemas que faciliten el pago.",0,{"$f":"+D143-D87-D31","v":0},0,0,0,0,0,0,0,0,0,0,0,0,0,0,0,0,0,0]
[null,"Localización y regularización de tomas clandestinas",0,{"$f":"+D144-D88-D32","v":0},0,0,0,0,0,0,0,0,0,0,0,0,0,0,0,0,0,0]
[null,"Censo de usuarios para mejorar el padrón. Establecimiento de esquemas de actualización continua del padrón.",0,{"$f":"+D145-D89-D33","v":0},0,0,0,0,0,0,0,0,0,0,0,0,0,0,0,0,0,0]
[null,"Sistema de cómputo para altas y bajas del padrón de usuarios.",0,{"$f":"+D146-D90-D34","v":0},0,0,0,0,0,0,0,0,0,0,0,0,0,0,0,0,0,0]
[null,"Estudio tarifario con el fin de realizar la actualización de las tarifas de agua",0,{"$f":"+D147-D91-D35","v":0},0,0,0,0,0,0,0,0,0,0,0,0,0,0,0,0,0,0]
[null,"Modificaciones a la estructura tarifaria",0,{"$f":"+D148-D92-D36","v":0},0,0,0,0,0,0,0,0,0,0,0,0,0,0,0,0,0,0]
[null,"Reformas para lograr que las tarifas se actualicen de manera continua",0,{"$f":"+D149-D93-D37","v":0},0,0,0,0,0,0,0,0,0,0,0,0,0,0,0,0,0,0]
[null,"Reformas al marco legal para que el OO pueda establecer tarifas adecuadas",0,{"$f":"+D150-D94-D38","v":0},0,0,0,0,0,0,0,0,0,0,0,0,0,0,0,0,0,0]
[null,"Total PAI para mejora de la Gestión Comercial",{"$f":"SUM(C193:C206)","v":0},0,0,0,0,0,0,0,0,0,0,0,0,0,0,0,0,0,0,0]
[null,"4. PAI para reducción de Pérdidas Físicas de Agua"]
[null,{"$f":"+B153","v":"Localización y reparación de fugas en tanques"},{"$f":"-C41","v":0},{"$f":"+D153-D97-D41","v":0},0,0,0,0,0,0,0,0,0,0,0,0,0,0,0,0,0,0]
[null,"Localización y reparación de fugas en tuberías principales y secundarias",0,{"$f":"+D154-D98-D42","v":0},0,0,0,0,0,0,0,0,0,0,0,0,0,0,0,0,0,0]
[null,"Instalación de micromedidores en las tomas",0,{"$f":"+D155-D99-D43","v":0},0,0,0,0,0,0,0,0,0,0,0,0,0,0,0,0,0,0]
[null,"Sistematización de lectura de micromedidores en tomas e incorporación de lecturas al sistema de facturación y cobranza",0,{"$f":"+D156-D100-D44","v":0},0,0,0,0,0,0,0,0,0,0,0,0,0,0,0,0,0,0]
[null,"Optimización hidráulica: sectorización de la red de distribución, control de presión, optimización de la capacidad de almacenamiento.",0,{"$f":"+D157-D101-D45","v":0},0,0,0,0,0,0,0,0,0,0,0,0,0,0,0,0,0,0]
[null,"Catastro de infraestructura hidráulica y de redes",0,{"$f":"+D158-D102-D46","v":0},0,0,0,0,0,0,0,0,0,0,0,0,0,0,0,0,0,0]
[null,"Instalación de macromedidores en captaciones",0,{"$f":"+D159-D103-D47","v":0},0,0,0,0,0,0,0,0,0,0,0,0,0,0,0,0,0,0]
[null,"Instalación de macromedidores en sectores",0,{"$f":"+D160-D104-D48","v":0},0,0,0,0,0,0,0,0,0,0,0,0,0,0,0,0,0,0]
[null,"Sistematización de lectura de macromedidores en captaciones y sectores ( p.ej. a través de telemetría)",0,{"$f":"+D161-D105-D49","v":0},0,0,0,0,0,0,0,0,0,0,0,0,0,0,0,0,0,0]
[null,"Sustitución de tuberías con alto índice de fugas",0,{"$f":"+D162-D106-D50","v":0},0,0,0,0,0,0,0,0,0,0,0,0,0,0,0,0,0,0]
[null,"Capacitación del personal del OO en operación de equipos",0,{"$f":"+D163-D107-D51","v":0},0,0,0,0,0,0,0,0,0,0,0,0,0,0,0,0,0,0]
[null,"Sistema de Información Geográfica",0,{"$f":"+D164-D108-D52","v":0},0,0,0,0,0,0,0,0,0,0,0,0,0,0,0,0,0,0]
[null,"Total PAI de reducciòn de Pérdidas Físicas de Agua",{"$f":"SUM(C209:C220)","v":0},0,0,0,0,0,0,0,0,0,0,0,0,0,0,0,0,0,0,0]
[null,"5. PAI para sostenibilidad a las acciones "]
[null,{"$f":"+B167","v":"Establecimiento de un comité ciudadano del organismo operador"},{"$f":"-C55","v":0},{"$f":"+D167-D111-D55","v":0},0,0,0,0,0,0,0,0,0,0,0,0,0,0,0,0,0,0]
[null,{"$f":"+B168","v":"Elaboración de un código de ética y suscripción por parte del personal del OO"},{"$f":"-C56","v":0},{"$f":"+D168-D112-D56","v":0},0,0,0,0,0,0,0,0,0,0,0,0,0,0,0,0,0,0]
[null,{"$f":"+B169","v":"Sistema informático de contabilidad"},{"$f":"-C57","v":0},{"$f":"+D169-D113-D57","v":0},0,0,0,0,0,0,0,0,0,0,0,0,0,0,0,0,0,0]
[null,{"$f":"+B170","v":"Sistema de planeación Integral"},{"$f":"-C58","v":0},{"$f":"+D170-D114-D58","v":0},0,0,0,0,0,0,0,0,0,0,0,0,0,0,0,0,0,0]
[null,{"$f":"+B171","v":"Asesoría para financiamiento de contraparte"},{"$f":"-C59","v":0},{"$f":"+D171-D115-D59","v":0},0,0,0,0,0,0,0,0,0,0,0,0,0,0,0,0,0,0]
[null,"Total PAI para sostenibilidad a las acciones",{"$f":"+SUM(C223:C227)","v":0},0,0,0,0,0,0,0,0,0,0,0,0,0,0,0,0,0,0,0]
[null,"Total PAIs",{"$f":"C228+C221+C207+C191+C186","v":0},0,0,0,0,0,0,0,0,0,0,0,0,0,0,0,0,0,0,0]

{"sheet":"Evaluacion","index":31,"n_rows":60,"n_cols":38,"rows_kept":60,"cut":false,"hidden":true,"merged":[[6,10,7,10],[3,2,3,9],[4,2,4,9],[6,14,6,18]]}
[]
[null,"Formato Evaluación 7. EVALUACION DE LOS PDI - RESULTADOS"]
[]
[null,"NOMBRE:",{"$f":"+'Acciones a Ejecutar'!B4","v":"X"}]
[null,"AÑO:",{"$f":"+'Acciones a Ejecutar'!B5","v":0}]
[null,null,null,null,null,null,null,null,null,null,null,null,null,null,{"$f":"+Datos!C6+1","v":1},{"$f":"+O6+1","v":2},{"$f":"+P6+1","v":3},{"$f":"+Q6+1","v":4},{"$f":"+R6+1","v":5}]
[null,{"$f":"+'Detalle evaluacion'!B8","v":"Inversiones PAI  (Millones de pesos)"},{"$f":"+'Detalle evaluacion'!C8","v":1},{"$f":"+'Detalle evaluacion'!D8","v":2},{"$f":"+'Detalle evaluacion'!E8","v":3},{"$f":"+'Detalle evaluacion'!F8","v":4},{"$f":"+'Detalle evaluacion'!G8","v":5},"TOTAL",null,{"$f":"+B7","v":"Inversiones PAI  (Millones de pesos)"},"VP Monto Inversión","VPN/VNI","TIR","VPN","Porcentaje de Ejecución de la inversión",null,null,null,null,"Total","JUSTIFICACIÓN",null,null,null,null,null,null,null,null,null,null,null,null,null,{"$f":"+O6","v":1},{"$f":"+AI7+1","v":2},{"$f":"+AJ7+1","v":3},{"$f":"+AK7+1","v":4}]
[null,{"$f":"+'Detalle evaluacion'!B9","v":"1. PAI para reducir gastos de energía eléctrica"},null,null,null,null,null,null,null,"1. PAI para reducir gastos de energía eléctrica",null,null,null,null,1,{"$f":"+O8+1","v":2},{"$f":"+P8+1","v":3},{"$f":"+Q8+1","v":4},{"$f":"+R8+1","v":5}]
[null,{"$f":"+'Detalle evaluacion'!B10","v":"Solicitud de cambio de tarifa eléctrica para reducir gasto por concepto de energía eléctrica."},{"$f":"+'Detalle evaluacion'!C10","v":0},{"$f":"+'Detalle evaluacion'!D10","v":0},{"$f":"+'Detalle evaluacion'!E10","v":0},{"$f":"+'Detalle evaluacion'!F10","v":0},{"$f":"+'Detalle evaluacion'!G10","v":0},{"$f":"SUM(C9:G9)","v":0},null,"Solicitud de cambio de tarifa eléctrica para reducir gasto por concepto de energía eléctrica.",{"$f":"+NPV('Datos basicos'!$B$8,C9:G9)","v":0},{"$f":"IFERROR(N9/K9,0)","v":0},{"$f":"IFERROR(IRR('Detalle evaluacion'!C178:V178),0)","v":0},{"$f":"+NPV('Datos basicos'!$B$8,'Detalle evaluacion'!C178:V178)","v":0},null,null,null,null,{"$f":"+IF('Acciones a Ejecutar'!B8=\"si\",1-SUM(O9:R9),0)","v":0},{"$f":"+SUM(O9:S9)","v":0},null,null,null,null,null,null,null,null,null,null,{"$f":"1-SUM(P9:R9)","v":1},{"$f":"+IF('Acciones a Ejecutar'!B8=\"si\",1,0)","v":0},{"$f":"+IF('Acciones a Ejecutar'!B8=\"si\",5,0)","v":0},null,{"$f":"IF('Acciones a Ejecutar'!$B8=\"si\",IF(OR(AI$7>Datos!$C$5,AND(AI$7=Datos!$C$5,Datos!$E$5<=Parametros!$D$37)),1,0),0)","v":0},{"$f":"IF('Acciones a Ejecutar'!$B8=\"si\",IF(OR(AJ$7>Datos!$C$5,AND(AJ$7=Datos!$C$5,Datos!$E$5<=Parametros!$D$37)),MAX(0,1-O9-Q9-R9),0),0)","v":0},{"$f":"IF('Acciones a Ejecutar'!$B8=\"si\",IF(OR(AK$7>Datos!$C$5,AND(AK$7=Datos!$C$5,Datos!$E$5<=Parametros!$D$37)),MAX(1-P9-R9-O9,0),0),0)","v":0},{"$f":"IF('Acciones a Ejecutar'!$B8=\"si\",IF(OR(AL$7>Datos!$C$5,AND(AL$7=Datos!$C$5,Datos!$E$5<=Parametros!$D$37)),MAX(1-Q9-O9-P9,0),0),0)","v":0}]
[null,{"$f":"+'Detalle evaluacion'!B11","v":"Reducción de la potencia reactiva (reducción del factor de potencia)"},{"$f":"+'Detalle evaluacion'!C11","v":0},{"$f":"+'Detalle evaluacion'!D11","v":0},{"$f":"+'Detalle evaluacion'!E11","v":0},{"$f":"+'Detalle evaluacion'!F11","v":0},{"$f":"+'Detalle evaluacion'!G11","v":0},0,null,"Reducción de la potencia reactiva (reducción del factor de potencia)",{"$f":"+NPV('Datos basicos'!$B$8,C10:G10)","v":0},0,{"$f":"IFERROR(IRR('Detalle evaluacion'!C179:V179),0)","v":0},{"$f":"+NPV('Datos basicos'!$B$8,'Detalle evaluacion'!C179:V179)","v":0},null,null,null,null,{"$f":"+IF('Acciones a Ejecutar'!B9=\"si\",1-SUM(O10:R10),0)","v":0},0,null,null,null,null,null,null,null,null,null,null,{"$f":"1-SUM(P10:R10)","v":1},{"$f":"+IF('Acciones a Ejecutar'!B9=\"si\",1,0)","v":0},{"$f":"+IF('Acciones a Ejecutar'!B9=\"si\",5,0)","v":0},null,{"$f":"IF('Acciones a Ejecutar'!$B9=\"si\",IF(OR(AI$7>Datos!$C$5,AND(AI$7=Datos!$C$5,Datos!$E$5<=Parametros!$D$37)),1,0),0)","v":0},{"$f":"IF('Acciones a Ejecutar'!$B9=\"si\",IF(OR(AJ$7>Datos!$C$5,AND(AJ$7=Datos!$C$5,Datos!$E$5<=Parametros!$D$37)),MAX(0,1-O10-Q10-R10),0),0)","v":0},{"$f":"IF('Acciones a Ejecutar'!$B9=\"si\",IF(OR(AK$7>Datos!$C$5,AND(AK$7=Datos!$C$5,Datos!$E$5<=Parametros!$D$37)),MAX(1-P10-R10-O10,0),0),0)","v":0},{"$f":"IF('Acciones a Ejecutar'!$B9=\"si\",IF(OR(AL$7>Datos!$C$5,AND(AL$7=Datos!$C$5,Datos!$E$5<=Parametros!$D$37)),MAX(1-Q10-O10-P10,0),0),0)","v":0}]
[null,{"$f":"+'Detalle evaluacion'!B12","v":"Sustitución de equipos de bombeo de agua potable para reducir consumo de energía"},{"$f":"+'Detalle evaluacion'!C12","v":0},{"$f":"+'Detalle evaluacion'!D12","v":0},{"$f":"+'Detalle evaluacion'!E12","v":0},{"$f":"+'Detalle evaluacion'!F12","v":0},{"$f":"+'Detalle evaluacion'!G12","v":0},0,null,"Sustitución de equipos de bombeo de agua potable para reducir consumo de energía",{"$f":"+NPV('Datos basicos'!$B$8,C11:G11)","v":0},0,{"$f":"IFERROR(IRR('Detalle evaluacion'!C180:V180),0)","v":0},{"$f":"+NPV('Datos basicos'!$B$8,'Detalle evaluacion'!C180:V180)","v":0},null,null,null,null,{"$f":"+IF('Acciones a Ejecutar'!B10=\"si\",1-SUM(O11:R11),0)","v":0},0,null,null,null,null,null,null,null,null,null,null,1,{"$f":"+IF('Acciones a Ejecutar'!B10=\"si\",1,0)","v":0},{"$f":"+IF('Acciones a Ejecutar'!B10=\"si\",5,0)","v":0},null,{"$f":"IF('Acciones a Ejecutar'!$B10=\"si\",IF(OR(AI$7>Datos!$C$5,AND(AI$7=Datos!$C$5,Datos!$E$5<=Parametros!$D$37)),1,0),0)","v":0},{"$f":"IF('Acciones a Ejecutar'!$B10=\"si\",IF(OR(AJ$7>Datos!$C$5,AND(AJ$7=Datos!$C$5,Datos!$E$5<=Parametros!$D$37)),MAX(0,1-O11-Q11-R11),0),0)","v":0},{"$f":"IF('Acciones a Ejecutar'!$B10=\"si\",IF(OR(AK$7>Datos!$C$5,AND(AK$7=Datos!$C$5,Datos!$E$5<=Parametros!$D$37)),MAX(1-P11-R11-O11,0),0),0)","v":0},{"$f":"IF('Acciones a Ejecutar'!$B10=\"si\",IF(OR(AL$7>Datos!$C$5,AND(AL$7=Datos!$C$5,Datos!$E$5<=Parametros!$D$37)),MAX(1-Q11-O11-P11,0),0),0)","v":0}]
[null,{"$f":"+'Detalle evaluacion'!B13","v":"Sustitución o construcción de tanques de almacenamiento de agua para modificar políticas de operación del equipo de bombeo"},{"$f":"+'Detalle evaluacion'!C13","v":0},{"$f":"+'Detalle evaluacion'!D13","v":0},{"$f":"+'Detalle evaluacion'!E13","v":0},{"$f":"+'Detalle evaluacion'!F13","v":0},{"$f":"+'Detalle evaluacion'!G13","v":0},0,null,"Sustitución o construcción de tanques de almacenamiento de agua para modificar políticas de operación del equipo de bombeo",{"$f":"+NPV('Datos basicos'!$B$8,C12:G12)","v":0},0,{"$f":"IFERROR(IRR('Detalle evaluacion'!C181:V181),0)","v":0},{"$f":"+NPV('Datos basicos'!$B$8,'Detalle evaluacion'!C181:V181)","v":0},null,null,null,null,{"$f":"+IF('Acciones a Ejecutar'!B11=\"si\",1-SUM(O12:R12),0)","v":0},0,null,null,null,null,null,null,null,null,null,null,1,{"$f":"+IF('Acciones a Ejecutar'!B11=\"si\",1,0)","v":0},{"$f":"+IF('Acciones a Ejecutar'!B11=\"si\",5,0)","v":0},null,{"$f":"IF('Acciones a Ejecutar'!$B11=\"si\",IF(OR(AI$7>Datos!$C$5,AND(AI$7=Datos!$C$5,Datos!$E$5<=Parametros!$D$37)),1,0),0)","v":0},{"$f":"IF('Acciones a Ejecutar'!$B11=\"si\",IF(OR(AJ$7>Datos!$C$5,AND(AJ$7=Datos!$C$5,Datos!$E$5<=Parametros!$D$37)),MAX(0,1-O12-Q12-R12),0),0)","v":0},{"$f":"IF('Acciones a Ejecutar'!$B11=\"si\",IF(OR(AK$7>Datos!$C$5,AND(AK$7=Datos!$C$5,Datos!$E$5<=Parametros!$D$37)),MAX(1-P12-R12-O12,0),0),0)","v":0},{"$f":"IF('Acciones a Ejecutar'!$B11=\"si\",IF(OR(AL$7>Datos!$C$5,AND(AL$7=Datos!$C$5,Datos!$E$5<=Parametros!$D$37)),MAX(1-Q12-O12-P12,0),0),0)","v":0}]
[null,{"$f":"+'Detalle evaluacion'!B14","v":"Automatización de equipos de bombeo para modificar políticas de operación"},{"$f":"+'Detalle evaluacion'!C14","v":0},{"$f":"+'Detalle evaluacion'!D14","v":0},{"$f":"+'Detalle evaluacion'!E14","v":0},{"$f":"+'Detalle evaluacion'!F14","v":0},{"$f":"+'Detalle evaluacion'!G14","v":0},0,null,"Automatización de equipos de bombeo para modificar políticas de operación",{"$f":"+NPV('Datos basicos'!$B$8,C13:G13)","v":0},0,{"$f":"IFERROR(IRR('Detalle evaluacion'!C182:V182),0)","v":0},{"$f":"+NPV('Datos basicos'!$B$8,'Detalle evaluacion'!C182:V182)","v":0},null,null,null,null,{"$f":"+IF('Acciones a Ejecutar'!B12=\"si\",1-SUM(O13:R13),0)","v":0},0,null,null,null,null,null,null,null,null,null,null,1,{"$f":"+IF('Acciones a Ejecutar'!B12=\"si\",1,0)","v":0},{"$f":"+IF('Acciones a Ejecutar'!B12=\"si\",5,0)","v":0},null,{"$f":"IF('Acciones a Ejecutar'!$B12=\"si\",IF(OR(AI$7>Datos!$C$5,AND(AI$7=Datos!$C$5,Datos!$E$5<=Parametros!$D$37)),1,0),0)","v":0},{"$f":"IF('Acciones a Ejecutar'!$B12=\"si\",IF(OR(AJ$7>Datos!$C$5,AND(AJ$7=Datos!$C$5,Datos!$E$5<=Parametros!$D$37)),MAX(0,1-O13-Q13-R13),0),0)","v":0},{"$f":"IF('Acciones a Ejecutar'!$B12=\"si\",IF(OR(AK$7>Datos!$C$5,AND(AK$7=Datos!$C$5,Datos!$E$5<=Parametros!$D$37)),MAX(1-P13-R13-O13,0),0),0)","v":0},{"$f":"IF('Acciones a Ejecutar'!$B12=\"si\",IF(OR(AL$7>Datos!$C$5,AND(AL$7=Datos!$C$5,Datos!$E$5<=Parametros!$D$37)),MAX(1-Q13-O13-P13,0),0),0)","v":0}]
[null,{"$f":"+'Detalle evaluacion'!B15","v":"Sustitución de bombas de alcantarillado"},{"$f":"+'Detalle evaluacion'!C15","v":0},{"$f":"+'Detalle evaluacion'!D15","v":0},{"$f":"+'Detalle evaluacion'!E15","v":0},{"$f":"+'Detalle evaluacion'!F15","v":0},{"$f":"+'Detalle evaluacion'!G15","v":0},0,null,"Sustitución de bombas de alcantarillado",{"$f":"+NPV('Datos basicos'!$B$8,C14:G14)","v":0},0,{"$f":"IFERROR(IRR('Detalle evaluacion'!C183:V183),0)","v":0},{"$f":"+NPV('Datos basicos'!$B$8,'Detalle evaluacion'!C183:V183)","v":0},null,null,null,null,{"$f":"+IF('Acciones a Ejecutar'!B13=\"si\",1-SUM(O14:R14),0)","v":0},0,null,null,null,null,null,null,null,null,null,null,1,{"$f":"+IF('Acciones a Ejecutar'!B13=\"si\",1,0)","v":0},{"$f":"+IF('Acciones a Ejecutar'!B13=\"si\",5,0)","v":0},null,{"$f":"IF('Acciones a Ejecutar'!$B13=\"si\",IF(OR(AI$7>Datos!$C$5,AND(AI$7=Datos!$C$5,Datos!$E$5<=Parametros!$D$37)),1,0),0)","v":0},{"$f":"IF('Acciones a Ejecutar'!$B13=\"si\",IF(OR(AJ$7>Datos!$C$5,AND(AJ$7=Datos!$C$5,Datos!$E$5<=Parametros!$D$37)),MAX(0,1-O14-Q14-R14),0),0)","v":0},{"$f":"IF('Acciones a Ejecutar'!$B13=\"si\",IF(OR(AK$7>Datos!$C$5,AND(AK$7=Datos!$C$5,Datos!$E$5<=Parametros!$D$37)),MAX(1-P14-R14-O14,0),0),0)","v":0},{"$f":"IF('Acciones a Ejecutar'!$B13=\"si\",IF(OR(AL$7>Datos!$C$5,AND(AL$7=Datos!$C$5,Datos!$E$5<=Parametros!$D$37)),MAX(1-Q14-O14-P14,0),0),0)","v":0}]
[null,{"$f":"+'Detalle evaluacion'!B16","v":"Reducción de gastos de energía en plantas de tratamiento de aguas residuales (PTAR)"},{"$f":"+'Detalle evaluacion'!C16","v":0},{"$f":"+'Detalle evaluacion'!D16","v":0},{"$f":"+'Detalle evaluacion'!E16","v":0},{"$f":"+'Detalle evaluacion'!F16","v":0},{"$f":"+'Detalle evaluacion'!G16","v":0},0,null,"Reducción de gastos de energía en plantas de tratamiento de aguas residuales (PTAR)",{"$f":"+NPV('Datos basicos'!$B$8,C15:G15)","v":0},0,{"$f":"IFERROR(IRR('Detalle evaluacion'!C184:V184),0)","v":0},{"$f":"+NPV('Datos basicos'!$B$8,'Detalle evaluacion'!C184:V184)","v":0},null,null,null,null,{"$f":"+IF('Acciones a Ejecutar'!B14=\"si\",1-SUM(O15:R15),0)","v":0},0,null,null,null,null,null,null,null,null,null,null,1,{"$f":"+IF('Acciones a Ejecutar'!B14=\"si\",1,0)","v":0},{"$f":"+IF('Acciones a Ejecutar'!B14=\"si\",5,0)","v":0},null,{"$f":"IF('Acciones a Ejecutar'!$B14=\"si\",IF(OR(AI$7>Datos!$C$5,AND(AI$7=Datos!$C$5,Datos!$E$5<=Parametros!$D$37)),1,0),0)","v":0},{"$f":"IF('Acciones a Ejecutar'!$B14=\"si\",IF(OR(AJ$7>Datos!$C$5,AND(AJ$7=Datos!$C$5,Datos!$E$5<=Parametros!$D$37)),MAX(0,1-O15-Q15-R15),0),0)","v":0},{"$f":"IF('Acciones a Ejecutar'!$B14=\"si\",IF(OR(AK$7>Datos!$C$5,AND(AK$7=Datos!$C$5,Datos!$E$5<=Parametros!$D$37)),MAX(1-P15-R15-O15,0),0),0)","v":0},{"$f":"IF('Acciones a Ejecutar'!$B14=\"si\",IF(OR(AL$7>Datos!$C$5,AND(AL$7=Datos!$C$5,Datos!$E$5<=Parametros!$D$37)),MAX(1-Q15-O15-P15,0),0),0)","v":0}]
[null,{"$f":"+'Detalle evaluacion'!B17","v":"Elaboración de una auditoría energética"},{"$f":"+'Detalle evaluacion'!C17","v":0},{"$f":"+'Detalle evaluacion'!D17","v":0},{"$f":"+'Detalle evaluacion'!E17","v":0},{"$f":"+'Detalle evaluacion'!F17","v":0},{"$f":"+'Detalle evaluacion'!G17","v":0},0,null,"Elaboración de una auditoría energética",{"$f":"+NPV('Datos basicos'!$B$8,C16:G16)","v":0},"N/A","N/A","N/A",null,null,null,null,{"$f":"+IF('Acciones a Ejecutar'!B15=\"si\",1-SUM(O16:R16),0)","v":0},0,null,null,null,null,null,null,null,null,null,null,1,{"$f":"+IF('Acciones a Ejecutar'!B15=\"si\",1,0)","v":0},{"$f":"+IF('Acciones a Ejecutar'!B15=\"si\",5,0)","v":0},null,{"$f":"IF('Acciones a Ejecutar'!$B15=\"si\",IF(OR(AI$7>Datos!$C$5,AND(AI$7=Datos!$C$5,Datos!$E$5<=Parametros!$D$37)),1,0),0)","v":0},{"$f":"IF('Acciones a Ejecutar'!$B15=\"si\",IF(OR(AJ$7>Datos!$C$5,AND(AJ$7=Datos!$C$5,Datos!$E$5<=Parametros!$D$37)),MAX(0,1-O16-Q16-R16),0),0)","v":0},{"$f":"IF('Acciones a Ejecutar'!$B15=\"si\",IF(OR(AK$7>Datos!$C$5,AND(AK$7=Datos!$C$5,Datos!$E$5<=Parametros!$D$37)),MAX(1-P16-R16-O16,0),0),0)","v":0},{"$f":"IF('Acciones a Ejecutar'!$B15=\"si\",IF(OR(AL$7>Datos!$C$5,AND(AL$7=Datos!$C$5,Datos!$E$5<=Parametros!$D$37)),MAX(1-Q16-O16-P16,0),0),0)","v":0}]
[null,{"$f":"+'Detalle evaluacion'!B18","v":"Total Inversión PAI para reducción de gastos de energía eléctrica"},{"$f":"+SUM(C9:C16)","v":0},{"$f":"+SUM(D9:D16)","v":0},{"$f":"+SUM(E9:E16)","v":0},{"$f":"+SUM(F9:F16)","v":0},{"$f":"+SUM(G9:G16)","v":0},0,null,"Total Inversión PAI para reducción de gastos de energía eléctrica",{"$f":"+NPV('Datos basicos'!$B$8,C17:G17)","v":0},{"$f":"IFERROR(N17/K17,0)","v":0},{"$f":"IFERROR(IRR('Detalle evaluacion'!C186:V186),0)","v":0},{"$f":"+NPV('Datos basicos'!$B$8,'Detalle evaluacion'!C186:V186)","v":0}]
[null,{"$f":"+'Detalle evaluacion'!B19","v":"2. PAI para incrementar la productividad del personal "},null,null,null,null,null,null,null,"2. PAI para incrementar la productividad del personal "]
[null,{"$f":"+'Detalle evaluacion'!B20","v":"Programa de capacitación y profesionalización para incrementar la productividad del personal."},{"$f":"+'Detalle evaluacion'!C20","v":0},{"$f":"+'Detalle evaluacion'!D20","v":0},{"$f":"+'Detalle evaluacion'!E20","v":0},{"$f":"+'Detalle evaluacion'!F20","v":0},{"$f":"+'Detalle evaluacion'!G20","v":0},{"$f":"SUM(C19:G19)","v":0},null,"Programa de capacitación y profesionalización para incrementar la productividad del personal.",{"$f":"+NPV('Datos basicos'!$B$8,C19:G19)","v":0},{"$f":"IFERROR(N19/K19,0)","v":0},{"$f":"IFERROR(IRR('Detalle evaluacion'!C188:V188),0)","v":0},{"$f":"+NPV('Datos basicos'!$B$8,'Detalle evaluacion'!C188:V188)","v":0},null,null,null,null,{"$f":"+IF('Acciones a Ejecutar'!B18=\"si\",1-SUM(O19:R19),0)","v":0},{"$f":"+SUM(O19:S19)","v":0},null,null,null,null,null,null,null,null,null,null,{"$f":"1-SUM(P19:R19)","v":1},{"$f":"+IF('Acciones a Ejecutar'!B18=\"si\",1,0)","v":0},{"$f":"+IF('Acciones a Ejecutar'!B18=\"si\",5,0)","v":0},null,{"$f":"IF('Acciones a Ejecutar'!$B18=\"si\",IF(OR(AI$7>Datos!$C$5,AND(AI$7=Datos!$C$5,Datos!$E$5<=Parametros!$D$37)),1,0),0)","v":0},{"$f":"IF('Acciones a Ejecutar'!$B18=\"si\",IF(OR(AJ$7>Datos!$C$5,AND(AJ$7=Datos!$C$5,Datos!$E$5<=Parametros!$D$37)),MAX(0,1-O19-Q19-R19),0),0)","v":0},{"$f":"IF('Acciones a Ejecutar'!$B18=\"si\",IF(OR(AK$7>Datos!$C$5,AND(AK$7=Datos!$C$5,Datos!$E$5<=Parametros!$D$37)),MAX(1-P19-R19-O19,0),0),0)","v":0},{"$f":"IF('Acciones a Ejecutar'!$B18=\"si\",IF(OR(AL$7>Datos!$C$5,AND(AL$7=Datos!$C$5,Datos!$E$5<=Parametros!$D$37)),MAX(1-Q19-O19-P19,0),0),0)","v":0}]
[null,{"$f":"+'Detalle evaluacion'!B21","v":"Revisión del manual de funciones y cargos del personal del OO"},{"$f":"+'Detalle evaluacion'!C21","v":0},{"$f":"+'Detalle evaluacion'!D21","v":0},{"$f":"+'Detalle evaluacion'!E21","v":0},{"$f":"+'Detalle evaluacion'!F21","v":0},{"$f":"+'Detalle evaluacion'!G21","v":0},{"$f":"SUM(C20:G20)","v":0},null,"Revisión del manual de funciones y cargos del personal del OO",{"$f":"+NPV('Datos basicos'!$B$8,C20:G20)","v":0},{"$f":"IFERROR(N20/K20,0)","v":0},{"$f":"IFERROR(IRR('Detalle evaluacion'!C189:V189),0)","v":0},{"$f":"+NPV('Datos basicos'!$B$8,'Detalle evaluacion'!C189:V189)","v":0},null,null,null,null,{"$f":"+IF('Acciones a Ejecutar'!B19=\"si\",1-SUM(O20:R20),0)","v":0},{"$f":"+SUM(O20:S20)","v":0},null,null,null,null,null,null,null,null,null,null,{"$f":"1-SUM(P20:R20)","v":1},{"$f":"+IF('Acciones a Ejecutar'!B19=\"si\",1,0)","v":0},{"$f":"+IF('Acciones a Ejecutar'!B19=\"si\",5,0)","v":0}]
[null,{"$f":"+'Detalle evaluacion'!B22","v":"Establecimiento de un programa de retiro voluntario y obligado"},{"$f":"+'Detalle evaluacion'!C22","v":0},{"$f":"+'Detalle evaluacion'!D22","v":0},{"$f":"+'Detalle evaluacion'!E22","v":0},{"$f":"+'Detalle evaluacion'!F22","v":0},{"$f":"+'Detalle evaluacion'!G22","v":0},{"$f":"SUM(C21:G21)","v":0},null,"Establecimiento de un programa de retiro voluntario y obligado",{"$f":"+NPV('Datos basicos'!$B$8,C21:G21)","v":0},{"$f":"IFERROR(N21/K21,0)","v":0},{"$f":"IFERROR(IRR('Detalle evaluacion'!C190:V190),0)","v":0},{"$f":"+NPV('Datos basicos'!$B$8,'Detalle evaluacion'!C190:V190)","v":0},null,null,null,null,{"$f":"+IF('Acciones a Ejecutar'!B20=\"si\",1-SUM(O21:R21),0)","v":0},{"$f":"+SUM(O21:S21)","v":0},null,null,null,null,null,null,null,null,null,null,{"$f":"1-SUM(P21:R21)","v":1},{"$f":"+IF('Acciones a Ejecutar'!B20=\"si\",1,0)","v":0},{"$f":"+IF('Acciones a Ejecutar'!B20=\"si\",5,0)","v":0}]
[null,{"$f":"+'Detalle evaluacion'!B23","v":"Total Inversión PAI para incrementar la productividad del personal"},{"$f":"+SUM(C19:C21)","v":0},0,0,0,0,0,null,"Total Inversión PAI para incrementar la productividad del personal",{"$f":"+NPV('Datos basicos'!$B$8,C22:G22)","v":0},{"$f":"IFERROR(N22/K22,0)","v":0},{"$f":"IFERROR(IRR('Detalle evaluacion'!C191:V191),0)","v":0},{"$f":"+NPV('Datos basicos'!$B$8,'Detalle evaluacion'!C191:V191)","v":0}]
[null,{"$f":"+'Detalle evaluacion'!B24","v":"3. PAI para mejora de la Gestión Comercial"},null,null,null,null,null,null,null,"3. PAI para mejora de la Gestión Comercial"]
[null,{"$f":"+'Detalle evaluacion'!B25","v":"Ajuste de consumos de cuota fija"},{"$f":"+'Detalle evaluacion'!C25","v":0},{"$f":"+'Detalle evaluacion'!D25","v":0},{"$f":"+'Detalle evaluacion'!E25","v":0},{"$f":"+'Detalle evaluacion'!F25","v":0},{"$f":"+'Detalle evaluacion'!G25","v":0},{"$f":"SUM(C24:G24)","v":0},null,"Ajuste de consumos de cuota fija",{"$f":"+NPV('Datos basicos'!$B$8,C24:G24)","v":0},{"$f":"IFERROR(N24/K24,0)","v":0},{"$f":"IFERROR(IRR('Detalle evaluacion'!C193:V193),0)","v":0},{"$f":"+NPV('Datos basicos'!$B$8,'Detalle evaluacion'!C193:V193)","v":0},null,null,null,null,{"$f":"+IF('Acciones a Ejecutar'!B23=\"si\",1-SUM(O24:R24),0)","v":0},{"$f":"+SUM(O24:S24)","v":0},null,null,null,null,null,null,null,null,null,null,{"$f":"1-SUM(P24:R24)","v":1},{"$f":"+IF('Acciones a Ejecutar'!B23=\"si\",1,0)","v":0},{"$f":"+IF('Acciones a Ejecutar'!B23=\"si\",5,0)","v":0},null,{"$f":"IF('Acciones a Ejecutar'!$B23=\"si\",IF(OR(AI$7>Datos!$C$5,AND(AI$7=Datos!$C$5,Datos!$E$5<=Parametros!$D$37)),1,0),0)","v":0},{"$f":"IF('Acciones a Ejecutar'!$B23=\"si\",IF(OR(AJ$7>Datos!$C$5,AND(AJ$7=Datos!$C$5,Datos!$E$5<=Parametros!$D$37)),MAX(0,1-O24-Q24-R24),0),0)","v":0},{"$f":"IF('Acciones a Ejecutar'!$B23=\"si\",IF(OR(AK$7>Datos!$C$5,AND(AK$7=Datos!$C$5,Datos!$E$5<=Parametros!$D$37)),MAX(1-P24-R24-O24,0),0),0)","v":0},{"$f":"IF('Acciones a Ejecutar'!$B23=\"si\",IF(OR(AL$7>Datos!$C$5,AND(AL$7=Datos!$C$5,Datos!$E$5<=Parametros!$D$37)),MAX(1-Q24-O24-P24,0),0),0)","v":0}]
[null,{"$f":"+'Detalle evaluacion'!B26","v":"Corrección de errores de micromedición mediante sustitución de medidores."},{"$f":"+'Detalle evaluacion'!C26","v":0},{"$f":"+'Detalle evaluacion'!D26","v":0},{"$f":"+'Detalle evaluacion'!E26","v":0},{"$f":"+'Detalle evaluacion'!F26","v":0},{"$f":"+'Detalle evaluacion'!G26","v":0},0,null,"Corrección de errores de micromedición mediante sustitución de medidores.",{"$f":"+NPV('Datos basicos'!$B$8,C25:G25)","v":0},0,{"$f":"IFERROR(IRR('Detalle evaluacion'!C194:V194),0)","v":0},{"$f":"+NPV('Datos basicos'!$B$8,'Detalle evaluacion'!C194:V194)","v":0},null,null,null,null,{"$f":"+IF('Acciones a Ejecutar'!B24=\"si\",1-SUM(O25:R25),0)","v":0},0,null,null,null,null,null,null,null,null,null,null,1,{"$f":"+IF('Acciones a Ejecutar'!B24=\"si\",1,0)","v":0},{"$f":"+IF('Acciones a Ejecutar'!B24=\"si\",5,0)","v":0},null,{"$f":"IF('Acciones a Ejecutar'!$B24=\"si\",IF(OR(AI$7>Datos!$C$5,AND(AI$7=Datos!$C$5,Datos!$E$5<=Parametros!$D$37)),1,0),0)","v":0},{"$f":"IF('Acciones a Ejecutar'!$B24=\"si\",IF(OR(AJ$7>Datos!$C$5,AND(AJ$7=Datos!$C$5,Datos!$E$5<=Parametros!$D$37)),MAX(0,1-O25-Q25-R25),0),0)","v":0},{"$f":"IF('Acciones a Ejecutar'!$B24=\"si\",IF(OR(AK$7>Datos!$C$5,AND(AK$7=Datos!$C$5,Datos!$E$5<=Parametros!$D$37)),MAX(1-P25-R25-O25,0),0),0)","v":0},{"$f":"IF('Acciones a Ejecutar'!$B24=\"si\",IF(OR(AL$7>Datos!$C$5,AND(AL$7=Datos!$C$5,Datos!$E$5<=Parametros!$D$37)),MAX(1-Q25-O25-P25,0),0),0)","v":0}]
[null,{"$f":"+'Detalle evaluacion'!B27","v":"Impartición de cursos de formación de recursos humanos en eficiencia comercial"},{"$f":"+'Detalle evaluacion'!C27","v":0},{"$f":"+'Detalle evaluacion'!D27","v":0},{"$f":"+'Detalle evaluacion'!E27","v":0},{"$f":"+'Detalle evaluacion'!F27","v":0},{"$f":"+'Detalle evaluacion'!G27","v":0},0,null,"Impartición de cursos de formación de recursos humanos en eficiencia comercial",{"$f":"+NPV('Datos basicos'!$B$8,C26:G26)","v":0},0,{"$f":"IFERROR(IRR('Detalle evaluacion'!C195:V195),0)","v":0},{"$f":"+NPV('Datos basicos'!$B$8,'Detalle evaluacion'!C195:V195)","v":0},null,null,null,null,{"$f":"+IF('Acciones a Ejecutar'!B25=\"si\",1-SUM(O26:R26),0)","v":0},0,null,null,null,null,null,null,null,null,null,null,1,{"$f":"+IF('Acciones a Ejecutar'!B25=\"si\",1,0)","v":0},{"$f":"+IF('Acciones a Ejecutar'!B25=\"si\",5,0)","v":0},null,{"$f":"IF('Acciones a Ejecutar'!$B25=\"si\",IF(OR(AI$7>Datos!$C$5,AND(AI$7=Datos!$C$5,Datos!$E$5<=Parametros!$D$37)),1,0),0)","v":0},{"$f":"IF('Acciones a Ejecutar'!$B25=\"si\",IF(OR(AJ$7>Datos!$C$5,AND(AJ$7=Datos!$C$5,Datos!$E$5<=Parametros!$D$37)),MAX(0,1-O26-Q26-R26),0),0)","v":0},{"$f":"IF('Acciones a Ejecutar'!$B25=\"si\",IF(OR(AK$7>Datos!$C$5,AND(AK$7=Datos!$C$5,Datos!$E$5<=Parametros!$D$37)),MAX(1-P26-R26-O26,0),0),0)","v":0},{"$f":"IF('Acciones a Ejecutar'!$B25=\"si\",IF(OR(AL$7>Datos!$C$5,AND(AL$7=Datos!$C$5,Datos!$E$5<=Parametros!$D$37)),MAX(1-Q26-O26-P26,0),0),0)","v":0}]
[null,{"$f":"+'Detalle evaluacion'!B28","v":"Impartición de cursos de formación de recursos humanos en atención a usuarios"},{"$f":"+'Detalle evaluacion'!C28","v":0},{"$f":"+'Detalle evaluacion'!D28","v":0},{"$f":"+'Detalle evaluacion'!E28","v":0},{"$f":"+'Detalle evaluacion'!F28","v":0},{"$f":"+'Detalle evaluacion'!G28","v":0},0,null,"Impartición de cursos de formación de recursos humanos en atención a usuarios",{"$f":"+NPV('Datos basicos'!$B$8,C27:G27)","v":0},0,{"$f":"IFERROR(IRR('Detalle evaluacion'!C196:V196),0)","v":0},{"$f":"+NPV('Datos basicos'!$B$8,'Detalle evaluacion'!C196:V196)","v":0},null,null,null,null,{"$f":"+IF('Acciones a Ejecutar'!B26=\"si\",1-SUM(O27:R27),0)","v":0},0,null,null,null,null,null,null,null,null,null,null,1,{"$f":"+IF('Acciones a Ejecutar'!B26=\"si\",1,0)","v":0},{"$f":"+IF('Acciones a Ejecutar'!B26=\"si\",5,0)","v":0},null,{"$f":"IF('Acciones a Ejecutar'!$B26=\"si\",IF(OR(AI$7>Datos!$C$5,AND(AI$7=Datos!$C$5,Datos!$E$5<=Parametros!$D$37)),1,0),0)","v":0},{"$f":"IF('Acciones a Ejecutar'!$B26=\"si\",IF(OR(AJ$7>Datos!$C$5,AND(AJ$7=Datos!$C$5,Datos!$E$5<=Parametros!$D$37)),MAX(0,1-O27-Q27-R27),0),0)","v":0},{"$f":"IF('Acciones a Ejecutar'!$B26=\"si\",IF(OR(AK$7>Datos!$C$5,AND(AK$7=Datos!$C$5,Datos!$E$5<=Parametros!$D$37)),MAX(1-P27-R27-O27,0),0),0)","v":0},{"$f":"IF('Acciones a Ejecutar'!$B26=\"si\",IF(OR(AL$7>Datos!$C$5,AND(AL$7=Datos!$C$5,Datos!$E$5<=Parametros!$D$37)),MAX(1-Q27-O27-P27,0),0),0)","v":0}]
[null,{"$f":"+'Detalle evaluacion'!B29","v":"Firma de convenios con bancos y otras instituciones para ampliar las opciones de pago de los servicios de agua y saneamiento"},{"$f":"+'Detalle evaluacion'!C29","v":0},{"$f":"+'Detalle evaluacion'!D29","v":0},{"$f":"+'Detalle evaluacion'!E29","v":0},{"$f":"+'Detalle evaluacion'!F29","v":0},{"$f":"+'Detalle evaluacion'!G29","v":0},0,null,"Firma de convenios con bancos y otras instituciones para ampliar las opciones de pago de los servicios de agua y saneamiento",{"$f":"+NPV('Datos basicos'!$B$8,C28:G28)","v":0},0,{"$f":"IFERROR(IRR('Detalle evaluacion'!C197:V197),0)","v":0},{"$f":"+NPV('Datos basicos'!$B$8,'Detalle evaluacion'!C197:V197)","v":0},null,null,null,null,{"$f":"+IF('Acciones a Ejecutar'!B27=\"si\",1-SUM(O28:R28),0)","v":0},0,null,null,null,null,null,null,null,null,null,null,1,{"$f":"+IF('Acciones a Ejecutar'!B27=\"si\",1,0)","v":0},{"$f":"+IF('Acciones a Ejecutar'!B27=\"si\",5,0)","v":0},null,{"$f":"IF('Acciones a Ejecutar'!$B27=\"si\",IF(OR(AI$7>Datos!$C$5,AND(AI$7=Datos!$C$5,Datos!$E$5<=Parametros!$D$37)),1,0),0)","v":0},{"$f":"IF('Acciones a Ejecutar'!$B27=\"si\",IF(OR(AJ$7>Datos!$C$5,AND(AJ$7=Datos!$C$5,Datos!$E$5<=Parametros!$D$37)),MAX(0,1-O28-Q28-R28),0),0)","v":0},{"$f":"IF('Acciones a Ejecutar'!$B27=\"si\",IF(OR(AK$7>Datos!$C$5,AND(AK$7=Datos!$C$5,Datos!$E$5<=Parametros!$D$37)),MAX(1-P28-R28-O28,0),0),0)","v":0},{"$f":"IF('Acciones a Ejecutar'!$B27=\"si\",IF(OR(AL$7>Datos!$C$5,AND(AL$7=Datos!$C$5,Datos!$E$5<=Parametros!$D$37)),MAX(1-Q28-O28-P28,0),0),0)","v":0}]
[null,{"$f":"+'Detalle evaluacion'!B30","v":"Mejoras a la facturación mediante un nuevo sistema comercial"},{"$f":"+'Detalle evaluacion'!C30","v":0},{"$f":"+'Detalle evaluacion'!D30","v":0},{"$f":"+'Detalle evaluacion'!E30","v":0},{"$f":"+'Detalle evaluacion'!F30","v":0},{"$f":"+'Detalle evaluacion'!G30","v":0},0,null,"Mejoras a la facturación mediante un nuevo sistema comercial",{"$f":"+NPV('Datos basicos'!$B$8,C29:G29)","v":0},0,{"$f":"IFERROR(IRR('Detalle evaluacion'!C198:V198),0)","v":0},{"$f":"+NPV('Datos basicos'!$B$8,'Detalle evaluacion'!C198:V198)","v":0},null,null,null,null,{"$f":"+IF('Acciones a Ejecutar'!B28=\"si\",1-SUM(O29:R29),0)","v":0},0,null,null,null,null,null,null,null,null,null,null,1,{"$f":"+IF('Acciones a Ejecutar'!B28=\"si\",1,0)","v":0},{"$f":"+IF('Acciones a Ejecutar'!B28=\"si\",5,0)","v":0},null,{"$f":"IF('Acciones a Ejecutar'!$B28=\"si\",IF(OR(AI$7>Datos!$C$5,AND(AI$7=Datos!$C$5,Datos!$E$5<=Parametros!$D$37)),1,0),0)","v":0},{"$f":"IF('Acciones a Ejecutar'!$B28=\"si\",IF(OR(AJ$7>Datos!$C$5,AND(AJ$7=Datos!$C$5,Datos!$E$5<=Parametros!$D$37)),MAX(0,1-O29-Q29-R29),0),0)","v":0},{"$f":"IF('Acciones a Ejecutar'!$B28=\"si\",IF(OR(AK$7>Datos!$C$5,AND(AK$7=Datos!$C$5,Datos!$E$5<=Parametros!$D$37)),MAX(1-P29-R29-O29,0),0),0)","v":0},{"$f":"IF('Acciones a Ejecutar'!$B28=\"si\",IF(OR(AL$7>Datos!$C$5,AND(AL$7=Datos!$C$5,Datos!$E$5<=Parametros!$D$37)),MAX(1-Q29-O29-P29,0),0),0)","v":0}]
[null,{"$f":"+'Detalle evaluacion'!B31","v":"Mejoras en la cobranza mediante esquemas que faciliten el pago."},{"$f":"+'Detalle evaluacion'!C31","v":0},{"$f":"+'Detalle evaluacion'!D31","v":0},{"$f":"+'Detalle evaluacion'!E31","v":0},{"$f":"+'Detalle evaluacion'!F31","v":0},{"$f":"+'Detalle evaluacion'!G31","v":0},0,null,"Mejoras en la cobranza mediante esquemas que faciliten el pago.",{"$f":"+NPV('Datos basicos'!$B$8,C30:G30)","v":0},0,{"$f":"IFERROR(IRR('Detalle evaluacion'!C199:V199),0)","v":0},{"$f":"+NPV('Datos basicos'!$B$8,'Detalle evaluacion'!C199:V199)","v":0},null,null,null,null,{"$f":"+IF('Acciones a Ejecutar'!B29=\"si\",1-SUM(O30:R30),0)","v":0},0,null,null,null,null,null,null,null,null,null,null,1,{"$f":"+IF('Acciones a Ejecutar'!B29=\"si\",1,0)","v":0},{"$f":"+IF('Acciones a Ejecutar'!B29=\"si\",5,0)","v":0},null,{"$f":"IF('Acciones a Ejecutar'!$B29=\"si\",IF(OR(AI$7>Datos!$C$5,AND(AI$7=Datos!$C$5,Datos!$E$5<=Parametros!$D$37)),1,0),0)","v":0},{"$f":"IF('Acciones a Ejecutar'!$B29=\"si\",IF(OR(AJ$7>Datos!$C$5,AND(AJ$7=Datos!$C$5,Datos!$E$5<=Parametros!$D$37)),MAX(0,1-O30-Q30-R30),0),0)","v":0},{"$f":"IF('Acciones a Ejecutar'!$B29=\"si\",IF(OR(AK$7>Datos!$C$5,AND(AK$7=Datos!$C$5,Datos!$E$5<=Parametros!$D$37)),MAX(1-P30-R30-O30,0),0),0)","v":0},{"$f":"IF('Acciones a Ejecutar'!$B29=\"si\",IF(OR(AL$7>Datos!$C$5,AND(AL$7=Datos!$C$5,Datos!$E$5<=Parametros!$D$37)),MAX(1-Q30-O30-P30,0),0),0)","v":0}]
[null,{"$f":"+'Detalle evaluacion'!B32","v":"Localización y regularización de tomas clandestinas"},{"$f":"+'Detalle evaluacion'!C32","v":0},{"$f":"+'Detalle evaluacion'!D32","v":0},{"$f":"+'Detalle evaluacion'!E32","v":0},{"$f":"+'Detalle evaluacion'!F32","v":0},{"$f":"+'Detalle evaluacion'!G32","v":0},0,null,"Localización y regularización de tomas clandestinas",{"$f":"+NPV('Datos basicos'!$B$8,C31:G31)","v":0},0,{"$f":"IFERROR(IRR('Detalle evaluacion'!C200:V200),0)","v":0},{"$f":"+NPV('Datos basicos'!$B$8,'Detalle evaluacion'!C200:V200)","v":0},null,null,null,null,{"$f":"+IF('Acciones a Ejecutar'!B30=\"si\",1-SUM(O31:R31),0)","v":0},0,null,null,null,null,null,null,null,null,null,null,1,{"$f":"+IF('Acciones a Ejecutar'!B30=\"si\",1,0)","v":0},{"$f":"+IF('Acciones a Ejecutar'!B30=\"si\",5,0)","v":0},null,{"$f":"IF('Acciones a Ejecutar'!$B30=\"si\",IF(OR(AI$7>Datos!$C$5,AND(AI$7=Datos!$C$5,Datos!$E$5<=Parametros!$D$37)),1,0),0)","v":0},{"$f":"IF('Acciones a Ejecutar'!$B30=\"si\",IF(OR(AJ$7>Datos!$C$5,AND(AJ$7=Datos!$C$5,Datos!$E$5<=Parametros!$D$37)),MAX(0,1-O31-Q31-R31),0),0)","v":0},{"$f":"IF('Acciones a Ejecutar'!$B30=\"si\",IF(OR(AK$7>Datos!$C$5,AND(AK$7=Datos!$C$5,Datos!$E$5<=Parametros!$D$37)),MAX(1-P31-R31-O31,0),0),0)","v":0},{"$f":"IF('Acciones a Ejecutar'!$B30=\"si\",IF(OR(AL$7>Datos!$C$5,AND(AL$7=Datos!$C$5,Datos!$E$5<=Parametros!$D$37)),MAX(1-Q31-O31-P31,0),0),0)","v":0}]
[null,{"$f":"+'Detalle evaluacion'!B33","v":"Censo de usuarios para mejorar el padrón. Establecimiento de esquemas de actualización continua del padrón."},{"$f":"+'Detalle evaluacion'!C33","v":0},{"$f":"+'Detalle evaluacion'!D33","v":0},{"$f":"+'Detalle evaluacion'!E33","v":0},{"$f":"+'Detalle evaluacion'!F33","v":0},{"$f":"+'Detalle evaluacion'!G33","v":0},0,null,"Censo de usuarios para mejorar el padrón. Establecimiento de esquemas de actualización continua del padrón.",{"$f":"+NPV('Datos basicos'!$B$8,C32:G32)","v":0},0,{"$f":"IFERROR(IRR('Detalle evaluacion'!C201:V201),0)","v":0},{"$f":"+NPV('Datos basicos'!$B$8,'Detalle evaluacion'!C201:V201)","v":0},null,null,null,null,{"$f":"+IF('Acciones a Ejecutar'!B31=\"si\",1-SUM(O32:R32),0)","v":0},0,null,null,null,null,null,null,null,null,null,null,1,{"$f":"+IF('Acciones a Ejecutar'!B31=\"si\",1,0)","v":0},{"$f":"+IF('Acciones a Ejecutar'!B31=\"si\",5,0)","v":0},null,{"$f":"IF('Acciones a Ejecutar'!$B31=\"si\",IF(OR(AI$7>Datos!$C$5,AND(AI$7=Datos!$C$5,Datos!$E$5<=Parametros!$D$37)),1,0),0)","v":0},{"$f":"IF('Acciones a Ejecutar'!$B31=\"si\",IF(OR(AJ$7>Datos!$C$5,AND(AJ$7=Datos!$C$5,Datos!$E$5<=Parametros!$D$37)),MAX(0,1-O32-Q32-R32),0),0)","v":0},{"$f":"IF('Acciones a Ejecutar'!$B31=\"si\",IF(OR(AK$7>Datos!$C$5,AND(AK$7=Datos!$C$5,Datos!$E$5<=Parametros!$D$37)),MAX(1-P32-R32-O32,0),0),0)","v":0},{"$f":"IF('Acciones a Ejecutar'!$B31=\"si\",IF(OR(AL$7>Datos!$C$5,AND(AL$7=Datos!$C$5,Datos!$E$5<=Parametros!$D$37)),MAX(1-Q32-O32-P32,0),0),0)","v":0}]
[null,{"$f":"+'Detalle evaluacion'!B34","v":"Sistema de cómputo para altas y bajas del padrón de usuarios."},{"$f":"+'Detalle evaluacion'!C34","v":0},{"$f":"+'Detalle evaluacion'!D34","v":0},{"$f":"+'Detalle evaluacion'!E34","v":0},{"$f":"+'Detalle evaluacion'!F34","v":0},{"$f":"+'Detalle evaluacion'!G34","v":0},0,null,"Sistema de cómputo para altas y bajas del padrón de usuarios.",{"$f":"+NPV('Datos basicos'!$B$8,C33:G33)","v":0},0,{"$f":"IFERROR(IRR('Detalle evaluacion'!C202:V202),0)","v":0},{"$f":"+NPV('Datos basicos'!$B$8,'Detalle evaluacion'!C202:V202)","v":0},null,null,null,null,{"$f":"+IF('Acciones a Ejecutar'!B32=\"si\",1-SUM(O33:R33),0)","v":0},0,null,null,null,null,null,null,null,null,null,null,1,{"$f":"+IF('Acciones a Ejecutar'!B32=\"si\",1,0)","v":0},{"$f":"+IF('Acciones a Ejecutar'!B32=\"si\",5,0)","v":0},null,{"$f":"IF('Acciones a Ejecutar'!$B32=\"si\",IF(OR(AI$7>Datos!$C$5,AND(AI$7=Datos!$C$5,Datos!$E$5<=Parametros!$D$37)),1,0),0)","v":0},{"$f":"IF('Acciones a Ejecutar'!$B32=\"si\",IF(OR(AJ$7>Datos!$C$5,AND(AJ$7=Datos!$C$5,Datos!$E$5<=Parametros!$D$37)),MAX(0,1-O33-Q33-R33),0),0)","v":0},{"$f":"IF('Acciones a Ejecutar'!$B32=\"si\",IF(OR(AK$7>Datos!$C$5,AND(AK$7=Datos!$C$5,Datos!$E$5<=Parametros!$D$37)),MAX(1-P33-R33-O33,0),0),0)","v":0},{"$f":"IF('Acciones a Ejecutar'!$B32=\"si\",IF(OR(AL$7>Datos!$C$5,AND(AL$7=Datos!$C$5,Datos!$E$5<=Parametros!$D$37)),MAX(1-Q33-O33-P33,0),0),0)","v":0}]
[null,{"$f":"+'Detalle evaluacion'!B35","v":"Estudio tarifario con el fin de realizar la actualización de las tarifas de agua"},{"$f":"+'Detalle evaluacion'!C35","v":0},{"$f":"+'Detalle evaluacion'!D35","v":0},{"$f":"+'Detalle evaluacion'!E35","v":0},{"$f":"+'Detalle evaluacion'!F35","v":0},{"$f":"+'Detalle evaluacion'!G35","v":0},0,null,"Estudio tarifario con el fin de realizar la actualización de las tarifas de agua",{"$f":"+NPV('Datos basicos'!$B$8,C34:G34)","v":0},0,{"$f":"IFERROR(IRR('Detalle evaluacion'!C203:V203),0)","v":0},{"$f":"+NPV('Datos basicos'!$B$8,'Detalle evaluacion'!C203:V203)","v":0},null,null,null,null,{"$f":"+IF('Acciones a Ejecutar'!B33=\"si\",1-SUM(O34:R34),0)","v":0},0,null,null,null,null,null,null,null,null,null,null,1,{"$f":"+IF('Acciones a Ejecutar'!B33=\"si\",1,0)","v":0},{"$f":"+IF('Acciones a Ejecutar'!B33=\"si\",5,0)","v":0},null,{"$f":"IF('Acciones a Ejecutar'!$B33=\"si\",IF(OR(AI$7>Datos!$C$5,AND(AI$7=Datos!$C$5,Datos!$E$5<=Parametros!$D$37)),1,0),0)","v":0},{"$f":"IF('Acciones a Ejecutar'!$B33=\"si\",IF(OR(AJ$7>Datos!$C$5,AND(AJ$7=Datos!$C$5,Datos!$E$5<=Parametros!$D$37)),MAX(0,1-O34-Q34-R34),0),0)","v":0},{"$f":"IF('Acciones a Ejecutar'!$B33=\"si\",IF(OR(AK$7>Datos!$C$5,AND(AK$7=Datos!$C$5,Datos!$E$5<=Parametros!$D$37)),MAX(1-P34-R34-O34,0),0),0)","v":0},{"$f":"IF('Acciones a Ejecutar'!$B33=\"si\",IF(OR(AL$7>Datos!$C$5,AND(AL$7=Datos!$C$5,Datos!$E$5<=Parametros!$D$37)),MAX(1-Q34-O34-P34,0),0),0)","v":0}]
[null,{"$f":"+'Detalle evaluacion'!B36","v":"Modificaciones a la estructura tarifaria"},{"$f":"+'Detalle evaluacion'!C36","v":0},{"$f":"+'Detalle evaluacion'!D36","v":0},{"$f":"+'Detalle evaluacion'!E36","v":0},{"$f":"+'Detalle evaluacion'!F36","v":0},{"$f":"+'Detalle evaluacion'!G36","v":0},0,null,"Modificaciones a la estructura tarifaria",{"$f":"+NPV('Datos basicos'!$B$8,C35:G35)","v":0},0,{"$f":"IFERROR(IRR('Detalle evaluacion'!C204:V204),0)","v":0},{"$f":"+NPV('Datos basicos'!$B$8,'Detalle evaluacion'!C204:V204)","v":0},null,null,null,null,{"$f":"+IF('Acciones a Ejecutar'!B34=\"si\",1-SUM(O35:R35),0)","v":0},0,null,null,null,null,null,null,null,null,null,null,1,{"$f":"+IF('Acciones a Ejecutar'!B34=\"si\",1,0)","v":0},{"$f":"+IF('Acciones a Ejecutar'!B34=\"si\",5,0)","v":0},null,{"$f":"IF('Acciones a Ejecutar'!$B34=\"si\",IF(OR(AI$7>Datos!$C$5,AND(AI$7=Datos!$C$5,Datos!$E$5<=Parametros!$D$37)),1,0),0)","v":0},{"$f":"IF('Acciones a Ejecutar'!$B34=\"si\",IF(OR(AJ$7>Datos!$C$5,AND(AJ$7=Datos!$C$5,Datos!$E$5<=Parametros!$D$37)),MAX(0,1-O35-Q35-R35),0),0)","v":0},{"$f":"IF('Acciones a Ejecutar'!$B34=\"si\",IF(OR(AK$7>Datos!$C$5,AND(AK$7=Datos!$C$5,Datos!$E$5<=Parametros!$D$37)),MAX(1-P35-R35-O35,0),0),0)","v":0},{"$f":"IF('Acciones a Ejecutar'!$B34=\"si\",IF(OR(AL$7>Datos!$C$5,AND(AL$7=Datos!$C$5,Datos!$E$5<=Parametros!$D$37)),MAX(1-Q35-O35-P35,0),0),0)","v":0}]
[null,{"$f":"+'Detalle evaluacion'!B37","v":"Reformas para lograr que las tarifas se actualicen de manera continua"},{"$f":"+'Detalle evaluacion'!C37","v":0},{"$f":"+'Detalle evaluacion'!D37","v":0},{"$f":"+'Detalle evaluacion'!E37","v":0},{"$f":"+'Detalle evaluacion'!F37","v":0},{"$f":"+'Detalle evaluacion'!G37","v":0},0,null,"Reformas para lograr que las tarifas se actualicen de manera continua",{"$f":"+NPV('Datos basicos'!$B$8,C36:G36)","v":0},0,{"$f":"IFERROR(IRR('Detalle evaluacion'!C205:V205),0)","v":0},{"$f":"+NPV('Datos basicos'!$B$8,'Detalle evaluacion'!C205:V205)","v":0},null,null,null,null,{"$f":"+IF('Acciones a Ejecutar'!B35=\"si\",1-SUM(O36:R36),0)","v":0},0,null,null,null,null,null,null,null,null,null,null,1,{"$f":"+IF('Acciones a Ejecutar'!B35=\"si\",1,0)","v":0},{"$f":"+IF('Acciones a Ejecutar'!B35=\"si\",5,0)","v":0},null,{"$f":"IF('Acciones a Ejecutar'!$B35=\"si\",IF(OR(AI$7>Datos!$C$5,AND(AI$7=Datos!$C$5,Datos!$E$5<=Parametros!$D$37)),1,0),0)","v":0},{"$f":"IF('Acciones a Ejecutar'!$B35=\"si\",IF(OR(AJ$7>Datos!$C$5,AND(AJ$7=Datos!$C$5,Datos!$E$5<=Parametros!$D$37)),MAX(0,1-O36-Q36-R36),0),0)","v":0},{"$f":"IF('Acciones a Ejecutar'!$B35=\"si\",IF(OR(AK$7>Datos!$C$5,AND(AK$7=Datos!$C$5,Datos!$E$5<=Parametros!$D$37)),MAX(1-P36-R36-O36,0),0),0)","v":0},{"$f":"IF('Acciones a Ejecutar'!$B35=\"si\",IF(OR(AL$7>Datos!$C$5,AND(AL$7=Datos!$C$5,Datos!$E$5<=Parametros!$D$37)),MAX(1-Q36-O36-P36,0),0),0)","v":0}]
[null,{"$f":"+'Detalle evaluacion'!B38","v":"Reformas al marco legal para que el OO pueda establecer tarifas adecuadas"},{"$f":"+'Detalle evaluacion'!C38","v":0},{"$f":"+'Detalle evaluacion'!D38","v":0},{"$f":"+'Detalle evaluacion'!E38","v":0},{"$f":"+'Detalle evaluacion'!F38","v":0},{"$f":"+'Detalle evaluacion'!G38","v":0},0,null,"Reformas al marco legal para que el OO pueda establecer tarifas adecuadas",{"$f":"+NPV('Datos basicos'!$B$8,C37:G37)","v":0},0,{"$f":"IFERROR(IRR('Detalle evaluacion'!C206:V206),0)","v":0},{"$f":"+NPV('Datos basicos'!$B$8,'Detalle evaluacion'!C206:V206)","v":0},null,null,null,null,{"$f":"+IF('Acciones a Ejecutar'!B36=\"si\",1-SUM(O37:R37),0)","v":0},0,null,null,null,null,null,null,null,null,null,null,1,{"$f":"+IF('Acciones a Ejecutar'!B36=\"si\",1,0)","v":0},{"$f":"+IF('Acciones a Ejecutar'!B36=\"si\",5,0)","v":0},null,{"$f":"IF('Acciones a Ejecutar'!$B36=\"si\",IF(OR(AI$7>Datos!$C$5,AND(AI$7=Datos!$C$5,Datos!$E$5<=Parametros!$D$37)),1,0),0)","v":0},{"$f":"IF('Acciones a Ejecutar'!$B36=\"si\",IF(OR(AJ$7>Datos!$C$5,AND(AJ$7=Datos!$C$5,Datos!$E$5<=Parametros!$D$37)),MAX(0,1-O37-Q37-R37),0),0)","v":0},{"$f":"IF('Acciones a Ejecutar'!$B36=\"si\",IF(OR(AK$7>Datos!$C$5,AND(AK$7=Datos!$C$5,Datos!$E$5<=Parametros!$D$37)),MAX(1-P37-R37-O37,0),0),0)","v":0},{"$f":"IF('Acciones a Ejecutar'!$B36=\"si\",IF(OR(AL$7>Datos!$C$5,AND(AL$7=Datos!$C$5,Datos!$E$5<=Parametros!$D$37)),MAX(1-Q37-O37-P37,0),0),0)","v":0}]
[null,{"$f":"+'Detalle evaluacion'!B39","v":"Total PAI para mejora de la Gestión Comercial"},{"$f":"+SUM(C24:C37)","v":0},0,0,0,0,0,null,"Total PAI para mejora de la Gestión Comercial",{"$f":"+NPV('Datos basicos'!$B$8,C38:G38)","v":0},0,{"$f":"IFERROR(IRR('Detalle evaluacion'!C207:V207),0)","v":0},{"$f":"+NPV('Datos basicos'!$B$8,'Detalle evaluacion'!C207:V207)","v":0}]
[null,{"$f":"+'Detalle evaluacion'!B40","v":"4. PAI para reducción de Pérdidas Físicas de Agua"},null,null,null,null,null,null,null,{"$f":"+B39","v":"4. PAI para reducción de Pérdidas Físicas de Agua"}]
[null,{"$f":"+'Detalle evaluacion'!B41","v":"Localización y reparación de fugas en tanques"},{"$f":"+'Detalle evaluacion'!C41","v":0},{"$f":"+'Detalle evaluacion'!D41","v":0},{"$f":"+'Detalle evaluacion'!E41","v":0},{"$f":"+'Detalle evaluacion'!F41","v":0},{"$f":"+'Detalle evaluacion'!G41","v":0},{"$f":"SUM(C40:G40)","v":0},null,"Localización y reparación de fugas en tanques",{"$f":"+NPV('Datos basicos'!$B$8,C40:G40)","v":0},{"$f":"IFERROR(N40/K40,0)","v":0},{"$f":"IFERROR(IRR('Detalle evaluacion'!C209:V209),0)","v":0},{"$f":"+NPV('Datos basicos'!$B$8,'Detalle evaluacion'!C209:V209)","v":0},null,null,null,null,{"$f":"+IF('Acciones a Ejecutar'!B39=\"si\",1-SUM(O40:R40),0)","v":0},{"$f":"+SUM(O40:S40)","v":0},null,null,null,null,null,null,null,null,null,null,{"$f":"1-SUM(P40:R40)","v":1},{"$f":"+IF('Acciones a Ejecutar'!B39=\"si\",1,0)","v":0},{"$f":"+IF('Acciones a Ejecutar'!B39=\"si\",5,0)","v":0},null,{"$f":"IF('Acciones a Ejecutar'!$B39=\"si\",IF(OR(AI$7>Datos!$C$5,AND(AI$7=Datos!$C$5,Datos!$E$5<=Parametros!$D$37)),1,0),0)","v":0},{"$f":"IF('Acciones a Ejecutar'!$B39=\"si\",IF(OR(AJ$7>Datos!$C$5,AND(AJ$7=Datos!$C$5,Datos!$E$5<=Parametros!$D$37)),MAX(0,1-O40-Q40-R40),0),0)","v":0},{"$f":"IF('Acciones a Ejecutar'!$B39=\"si\",IF(OR(AK$7>Datos!$C$5,AND(AK$7=Datos!$C$5,Datos!$E$5<=Parametros!$D$37)),MAX(1-P40-R40-O40,0),0),0)","v":0},{"$f":"IF('Acciones a Ejecutar'!$B39=\"si\",IF(OR(AL$7>Datos!$C$5,AND(AL$7=Datos!$C$5,Datos!$E$5<=Parametros!$D$37)),MAX(1-Q40-O40-P40,0),0),0)","v":0}]
[null,{"$f":"+'Detalle evaluacion'!B42","v":"Localización y reparación de fugas en tuberías principales y secundarias"},{"$f":"+'Detalle evaluacion'!C42","v":0},{"$f":"+'Detalle evaluacion'!D42","v":0},{"$f":"+'Detalle evaluacion'!E42","v":0},{"$f":"+'Detalle evaluacion'!F42","v":0},{"$f":"+'Detalle evaluacion'!G42","v":0},0,null,"Localización y reparación de fugas en tuberías principales y secundarias",{"$f":"+NPV('Datos basicos'!$B$8,C41:G41)","v":0},0,{"$f":"IFERROR(IRR('Detalle evaluacion'!C210:V210),0)","v":0},{"$f":"+NPV('Datos basicos'!$B$8,'Detalle evaluacion'!C210:V210)","v":0},null,null,null,null,{"$f":"+IF('Acciones a Ejecutar'!B40=\"si\",1-SUM(O41:R41),0)","v":0},0,null,null,null,null,null,null,null,null,null,null,1,{"$f":"+IF('Acciones a Ejecutar'!B40=\"si\",1,0)","v":0},{"$f":"+IF('Acciones a Ejecutar'!B40=\"si\",5,0)","v":0},null,{"$f":"IF('Acciones a Ejecutar'!$B40=\"si\",IF(OR(AI$7>Datos!$C$5,AND(AI$7=Datos!$C$5,Datos!$E$5<=Parametros!$D$37)),1,0),0)","v":0},{"$f":"IF('Acciones a Ejecutar'!$B40=\"si\",IF(OR(AJ$7>Datos!$C$5,AND(AJ$7=Datos!$C$5,Datos!$E$5<=Parametros!$D$37)),MAX(0,1-O41-Q41-R41),0),0)","v":0},{"$f":"IF('Acciones a Ejecutar'!$B40=\"si\",IF(OR(AK$7>Datos!$C$5,AND(AK$7=Datos!$C$5,Datos!$E$5<=Parametros!$D$37)),MAX(1-P41-R41-O41,0),0),0)","v":0},{"$f":"IF('Acciones a Ejecutar'!$B40=\"si\",IF(OR(AL$7>Datos!$C$5,AND(AL$7=Datos!$C$5,Datos!$E$5<=Parametros!$D$37)),MAX(1-Q41-O41-P41,0),0),0)","v":0}]
[null,{"$f":"+'Detalle evaluacion'!B43","v":"Instalación de micromedidores en las tomas"},{"$f":"+'Detalle evaluacion'!C43","v":0},{"$f":"+'Detalle evaluacion'!D43","v":0},{"$f":"+'Detalle evaluacion'!E43","v":0},{"$f":"+'Detalle evaluacion'!F43","v":0},{"$f":"+'Detalle evaluacion'!G43","v":0},0,null,"Instalación de micromedidores en las tomas",{"$f":"+NPV('Datos basicos'!$B$8,C42:G42)","v":0},0,{"$f":"IFERROR(IRR('Detalle evaluacion'!C211:V211),0)","v":0},{"$f":"+NPV('Datos basicos'!$B$8,'Detalle evaluacion'!C211:V211)","v":0},null,null,null,null,{"$f":"+IF('Acciones a Ejecutar'!B41=\"si\",1-SUM(O42:R42),0)","v":0},0,null,null,null,null,null,null,null,null,null,null,1,{"$f":"+IF('Acciones a Ejecutar'!B41=\"si\",1,0)","v":0},{"$f":"+IF('Acciones a Ejecutar'!B41=\"si\",5,0)","v":0},null,{"$f":"IF('Acciones a Ejecutar'!$B41=\"si\",IF(OR(AI$7>Datos!$C$5,AND(AI$7=Datos!$C$5,Datos!$E$5<=Parametros!$D$37)),1,0),0)","v":0},{"$f":"IF('Acciones a Ejecutar'!$B41=\"si\",IF(OR(AJ$7>Datos!$C$5,AND(AJ$7=Datos!$C$5,Datos!$E$5<=Parametros!$D$37)),MAX(0,1-O42-Q42-R42),0),0)","v":0},{"$f":"IF('Acciones a Ejecutar'!$B41=\"si\",IF(OR(AK$7>Datos!$C$5,AND(AK$7=Datos!$C$5,Datos!$E$5<=Parametros!$D$37)),MAX(1-P42-R42-O42,0),0),0)","v":0},{"$f":"IF('Acciones a Ejecutar'!$B41=\"si\",IF(OR(AL$7>Datos!$C$5,AND(AL$7=Datos!$C$5,Datos!$E$5<=Parametros!$D$37)),MAX(1-Q42-O42-P42,0),0),0)","v":0}]
[null,{"$f":"+'Detalle evaluacion'!B44","v":"Sistematización de lectura de micromedidores en tomas e incorporación de lecturas al sistema de facturación y cobranza"},{"$f":"+'Detalle evaluacion'!C44","v":0},{"$f":"+'Detalle evaluacion'!D44","v":0},{"$f":"+'Detalle evaluacion'!E44","v":0},{"$f":"+'Detalle evaluacion'!F44","v":0},{"$f":"+'Detalle evaluacion'!G44","v":0},0,null,"Sistematización de lectura de micromedidores en tomas e incorporación de lecturas al sistema de facturación y cobranza",{"$f":"+NPV('Datos basicos'!$B$8,C43:G43)","v":0},0,{"$f":"IFERROR(IRR('Detalle evaluacion'!C212:V212),0)","v":0},{"$f":"+NPV('Datos basicos'!$B$8,'Detalle evaluacion'!C212:V212)","v":0},null,null,null,null,{"$f":"+IF('Acciones a Ejecutar'!B42=\"si\",1-SUM(O43:R43),0)","v":0},0,null,null,null,null,null,null,null,null,null,null,1,{"$f":"+IF('Acciones a Ejecutar'!B42=\"si\",1,0)","v":0},{"$f":"+IF('Acciones a Ejecutar'!B42=\"si\",5,0)","v":0},null,{"$f":"IF('Acciones a Ejecutar'!$B42=\"si\",IF(OR(AI$7>Datos!$C$5,AND(AI$7=Datos!$C$5,Datos!$E$5<=Parametros!$D$37)),1,0),0)","v":0},{"$f":"IF('Acciones a Ejecutar'!$B42=\"si\",IF(OR(AJ$7>Datos!$C$5,AND(AJ$7=Datos!$C$5,Datos!$E$5<=Parametros!$D$37)),MAX(0,1-O43-Q43-R43),0),0)","v":0},{"$f":"IF('Acciones a Ejecutar'!$B42=\"si\",IF(OR(AK$7>Datos!$C$5,AND(AK$7=Datos!$C$5,Datos!$E$5<=Parametros!$D$37)),MAX(1-P43-R43-O43,0),0),0)","v":0},{"$f":"IF('Acciones a Ejecutar'!$B42=\"si\",IF(OR(AL$7>Datos!$C$5,AND(AL$7=Datos!$C$5,Datos!$E$5<=Parametros!$D$37)),MAX(1-Q43-O43-P43,0),0),0)","v":0}]
[null,{"$f":"+'Detalle evaluacion'!B45","v":"Optimización hidráulica: sectorización de la red de distribución, control de presión, optimización de la capacidad de almacenamiento."},{"$f":"+'Detalle evaluacion'!C45","v":0},{"$f":"+'Detalle evaluacion'!D45","v":0},{"$f":"+'Detalle evaluacion'!E45","v":0},{"$f":"+'Detalle evaluacion'!F45","v":0},{"$f":"+'Detalle evaluacion'!G45","v":0},0,null,"Optimización hidráulica: sectorización de la red de distribución, control de presión, optimización de la capacidad de almacenamiento.",{"$f":"+NPV('Datos basicos'!$B$8,C44:G44)","v":0},0,{"$f":"IFERROR(IRR('Detalle evaluacion'!C213:V213),0)","v":0},{"$f":"+NPV('Datos basicos'!$B$8,'Detalle evaluacion'!C213:V213)","v":0},null,null,null,null,{"$f":"+IF('Acciones a Ejecutar'!B43=\"si\",1-SUM(O44:R44),0)","v":0},0,null,null,null,null,null,null,null,null,null,null,1,{"$f":"+IF('Acciones a Ejecutar'!B43=\"si\",1,0)","v":0},{"$f":"+IF('Acciones a Ejecutar'!B43=\"si\",5,0)","v":0},null,{"$f":"IF('Acciones a Ejecutar'!$B43=\"si\",IF(OR(AI$7>Datos!$C$5,AND(AI$7=Datos!$C$5,Datos!$E$5<=Parametros!$D$37)),1,0),0)","v":0},{"$f":"IF('Acciones a Ejecutar'!$B43=\"si\",IF(OR(AJ$7>Datos!$C$5,AND(AJ$7=Datos!$C$5,Datos!$E$5<=Parametros!$D$37)),MAX(0,1-O44-Q44-R44),0),0)","v":0},{"$f":"IF('Acciones a Ejecutar'!$B43=\"si\",IF(OR(AK$7>Datos!$C$5,AND(AK$7=Datos!$C$5,Datos!$E$5<=Parametros!$D$37)),MAX(1-P44-R44-O44,0),0),0)","v":0},{"$f":"IF('Acciones a Ejecutar'!$B43=\"si\",IF(OR(AL$7>Datos!$C$5,AND(AL$7=Datos!$C$5,Datos!$E$5<=Parametros!$D$37)),MAX(1-Q44-O44-P44,0),0),0)","v":0}]
[null,{"$f":"+'Detalle evaluacion'!B46","v":"Catastro de infraestructura hidráulica y de redes"},{"$f":"+'Detalle evaluacion'!C46","v":0},{"$f":"+'Detalle evaluacion'!D46","v":0},{"$f":"+'Detalle evaluacion'!E46","v":0},{"$f":"+'Detalle evaluacion'!F46","v":0},{"$f":"+'Detalle evaluacion'!G46","v":0},0,null,"Catastro de infraestructura hidráulica y de redes",{"$f":"+NPV('Datos basicos'!$B$8,C45:G45)","v":0},0,{"$f":"IFERROR(IRR('Detalle evaluacion'!C214:V214),0)","v":0},{"$f":"+NPV('Datos basicos'!$B$8,'Detalle evaluacion'!C214:V214)","v":0},null,null,null,null,{"$f":"+IF('Acciones a Ejecutar'!B44=\"si\",1-SUM(O45:R45),0)","v":0},0,null,null,null,null,null,null,null,null,null,null,1,{"$f":"+IF('Acciones a Ejecutar'!B44=\"si\",1,0)","v":0},{"$f":"+IF('Acciones a Ejecutar'!B44=\"si\",5,0)","v":0},null,{"$f":"IF('Acciones a Ejecutar'!$B44=\"si\",IF(OR(AI$7>Datos!$C$5,AND(AI$7=Datos!$C$5,Datos!$E$5<=Parametros!$D$37)),1,0),0)","v":0},{"$f":"IF('Acciones a Ejecutar'!$B44=\"si\",IF(OR(AJ$7>Datos!$C$5,AND(AJ$7=Datos!$C$5,Datos!$E$5<=Parametros!$D$37)),MAX(0,1-O45-Q45-R45),0),0)","v":0},{"$f":"IF('Acciones a Ejecutar'!$B44=\"si\",IF(OR(AK$7>Datos!$C$5,AND(AK$7=Datos!$C$5,Datos!$E$5<=Parametros!$D$37)),MAX(1-P45-R45-O45,0),0),0)","v":0},{"$f":"IF('Acciones a Ejecutar'!$B44=\"si\",IF(OR(AL$7>Datos!$C$5,AND(AL$7=Datos!$C$5,Datos!$E$5<=Parametros!$D$37)),MAX(1-Q45-O45-P45,0),0),0)","v":0}]
[null,{"$f":"+'Detalle evaluacion'!B47","v":"Instalación de macromedidores en captaciones"},{"$f":"+'Detalle evaluacion'!C47","v":0},{"$f":"+'Detalle evaluacion'!D47","v":0},{"$f":"+'Detalle evaluacion'!E47","v":0},{"$f":"+'Detalle evaluacion'!F47","v":0},{"$f":"+'Detalle evaluacion'!G47","v":0},0,null,"Instalación de macromedidores en captaciones",{"$f":"+NPV('Datos basicos'!$B$8,C46:G46)","v":0},0,{"$f":"IFERROR(IRR('Detalle evaluacion'!C215:V215),0)","v":0},{"$f":"+NPV('Datos basicos'!$B$8,'Detalle evaluacion'!C215:V215)","v":0},null,null,null,null,{"$f":"+IF('Acciones a Ejecutar'!B45=\"si\",1-SUM(O46:R46),0)","v":0},0,null,null,null,null,null,null,null,null,null,null,1,{"$f":"+IF('Acciones a Ejecutar'!B45=\"si\",1,0)","v":0},{"$f":"+IF('Acciones a Ejecutar'!B45=\"si\",5,0)","v":0},null,{"$f":"IF('Acciones a Ejecutar'!$B45=\"si\",IF(OR(AI$7>Datos!$C$5,AND(AI$7=Datos!$C$5,Datos!$E$5<=Parametros!$D$37)),1,0),0)","v":0},{"$f":"IF('Acciones a Ejecutar'!$B45=\"si\",IF(OR(AJ$7>Datos!$C$5,AND(AJ$7=Datos!$C$5,Datos!$E$5<=Parametros!$D$37)),MAX(0,1-O46-Q46-R46),0),0)","v":0},{"$f":"IF('Acciones a Ejecutar'!$B45=\"si\",IF(OR(AK$7>Datos!$C$5,AND(AK$7=Datos!$C$5,Datos!$E$5<=Parametros!$D$37)),MAX(1-P46-R46-O46,0),0),0)","v":0},{"$f":"IF('Acciones a Ejecutar'!$B45=\"si\",IF(OR(AL$7>Datos!$C$5,AND(AL$7=Datos!$C$5,Datos!$E$5<=Parametros!$D$37)),MAX(1-Q46-O46-P46,0),0),0)","v":0}]
[null,{"$f":"+'Detalle evaluacion'!B48","v":"Instalación de macromedidores en sectores"},{"$f":"+'Detalle evaluacion'!C48","v":0},{"$f":"+'Detalle evaluacion'!D48","v":0},{"$f":"+'Detalle evaluacion'!E48","v":0},{"$f":"+'Detalle evaluacion'!F48","v":0},{"$f":"+'Detalle evaluacion'!G48","v":0},0,null,"Instalación de macromedidores en sectores",{"$f":"+NPV('Datos basicos'!$B$8,C47:G47)","v":0},0,{"$f":"IFERROR(IRR('Detalle evaluacion'!C216:V216),0)","v":0},{"$f":"+NPV('Datos basicos'!$B$8,'Detalle evaluacion'!C216:V216)","v":0},null,null,null,null,{"$f":"+IF('Acciones a Ejecutar'!B46=\"si\",1-SUM(O47:R47),0)","v":0},0,null,null,null,null,null,null,null,null,null,null,1,{"$f":"+IF('Acciones a Ejecutar'!B46=\"si\",1,0)","v":0},{"$f":"+IF('Acciones a Ejecutar'!B46=\"si\",5,0)","v":0},null,{"$f":"IF('Acciones a Ejecutar'!$B46=\"si\",IF(OR(AI$7>Datos!$C$5,AND(AI$7=Datos!$C$5,Datos!$E$5<=Parametros!$D$37)),1,0),0)","v":0},{"$f":"IF('Acciones a Ejecutar'!$B46=\"si\",IF(OR(AJ$7>Datos!$C$5,AND(AJ$7=Datos!$C$5,Datos!$E$5<=Parametros!$D$37)),MAX(0,1-O47-Q47-R47),0),0)","v":0},{"$f":"IF('Acciones a Ejecutar'!$B46=\"si\",IF(OR(AK$7>Datos!$C$5,AND(AK$7=Datos!$C$5,Datos!$E$5<=Parametros!$D$37)),MAX(1-P47-R47-O47,0),0),0)","v":0},{"$f":"IF('Acciones a Ejecutar'!$B46=\"si\",IF(OR(AL$7>Datos!$C$5,AND(AL$7=Datos!$C$5,Datos!$E$5<=Parametros!$D$37)),MAX(1-Q47-O47-P47,0),0),0)","v":0}]
[null,{"$f":"+'Detalle evaluacion'!B49","v":"Sistematización de lectura de macromedidores en captaciones y sectores ( p.ej. a través de telemetría)"},{"$f":"+'Detalle evaluacion'!C49","v":0},{"$f":"+'Detalle evaluacion'!D49","v":0},{"$f":"+'Detalle evaluacion'!E49","v":0},{"$f":"+'Detalle evaluacion'!F49","v":0},{"$f":"+'Detalle evaluacion'!G49","v":0},0,null,"Sistematización de lectura de macromedidores en captaciones y sectores ( p.ej. a través de telemetría)",{"$f":"+NPV('Datos basicos'!$B$8,C48:G48)","v":0},0,{"$f":"IFERROR(IRR('Detalle evaluacion'!C217:V217),0)","v":0},{"$f":"+NPV('Datos basicos'!$B$8,'Detalle evaluacion'!C217:V217)","v":0},null,null,null,null,{"$f":"+IF('Acciones a Ejecutar'!B47=\"si\",1-SUM(O48:R48),0)","v":0},0,null,null,null,null,null,null,null,null,null,null,1,{"$f":"+IF('Acciones a Ejecutar'!B47=\"si\",1,0)","v":0},{"$f":"+IF('Acciones a Ejecutar'!B47=\"si\",5,0)","v":0},null,{"$f":"IF('Acciones a Ejecutar'!$B47=\"si\",IF(OR(AI$7>Datos!$C$5,AND(AI$7=Datos!$C$5,Datos!$E$5<=Parametros!$D$37)),1,0),0)","v":0},{"$f":"IF('Acciones a Ejecutar'!$B47=\"si\",IF(OR(AJ$7>Datos!$C$5,AND(AJ$7=Datos!$C$5,Datos!$E$5<=Parametros!$D$37)),MAX(0,1-O48-Q48-R48),0),0)","v":0},{"$f":"IF('Acciones a Ejecutar'!$B47=\"si\",IF(OR(AK$7>Datos!$C$5,AND(AK$7=Datos!$C$5,Datos!$E$5<=Parametros!$D$37)),MAX(1-P48-R48-O48,0),0),0)","v":0},{"$f":"IF('Acciones a Ejecutar'!$B47=\"si\",IF(OR(AL$7>Datos!$C$5,AND(AL$7=Datos!$C$5,Datos!$E$5<=Parametros!$D$37)),MAX(1-Q48-O48-P48,0),0),0)","v":0}]
[null,{"$f":"+'Detalle evaluacion'!B50","v":"Sustitución de tuberías con alto índice de fugas"},{"$f":"+'Detalle evaluacion'!C50","v":0},{"$f":"+'Detalle evaluacion'!D50","v":0},{"$f":"+'Detalle evaluacion'!E50","v":0},{"$f":"+'Detalle evaluacion'!F50","v":0},{"$f":"+'Detalle evaluacion'!G50","v":0},0,null,"Sustitución de tuberías con alto índice de fugas",{"$f":"+NPV('Datos basicos'!$B$8,C49:G49)","v":0},0,{"$f":"IFERROR(IRR('Detalle evaluacion'!C218:V218),0)","v":0},{"$f":"+NPV('Datos basicos'!$B$8,'Detalle evaluacion'!C218:V218)","v":0},null,null,null,null,{"$f":"+IF('Acciones a Ejecutar'!B48=\"si\",1-SUM(O49:R49),0)","v":0},0,null,null,null,null,null,null,null,null,null,null,1,{"$f":"+IF('Acciones a Ejecutar'!B48=\"si\",1,0)","v":0},{"$f":"+IF('Acciones a Ejecutar'!B48=\"si\",5,0)","v":0},null,{"$f":"IF('Acciones a Ejecutar'!$B48=\"si\",IF(OR(AI$7>Datos!$C$5,AND(AI$7=Datos!$C$5,Datos!$E$5<=Parametros!$D$37)),1,0),0)","v":0},{"$f":"IF('Acciones a Ejecutar'!$B48=\"si\",IF(OR(AJ$7>Datos!$C$5,AND(AJ$7=Datos!$C$5,Datos!$E$5<=Parametros!$D$37)),MAX(0,1-O49-Q49-R49),0),0)","v":0},{"$f":"IF('Acciones a Ejecutar'!$B48=\"si\",IF(OR(AK$7>Datos!$C$5,AND(AK$7=Datos!$C$5,Datos!$E$5<=Parametros!$D$37)),MAX(1-P49-R49-O49,0),0),0)","v":0},{"$f":"IF('Acciones a Ejecutar'!$B48=\"si\",IF(OR(AL$7>Datos!$C$5,AND(AL$7=Datos!$C$5,Datos!$E$5<=Parametros!$D$37)),MAX(1-Q49-O49-P49,0),0),0)","v":0}]
[null,{"$f":"+'Detalle evaluacion'!B51","v":"Capacitación del personal del OO en operación de equipos"},{"$f":"+'Detalle evaluacion'!C51","v":0},{"$f":"+'Detalle evaluacion'!D51","v":0},{"$f":"+'Detalle evaluacion'!E51","v":0},{"$f":"+'Detalle evaluacion'!F51","v":0},{"$f":"+'Detalle evaluacion'!G51","v":0},0,null,"Capacitación del personal del OO en operación de equipos",{"$f":"+NPV('Datos basicos'!$B$8,C50:G50)","v":0},0,{"$f":"IFERROR(IRR('Detalle evaluacion'!C219:V219),0)","v":0},{"$f":"+NPV('Datos basicos'!$B$8,'Detalle evaluacion'!C219:V219)","v":0},null,null,null,null,{"$f":"+IF('Acciones a Ejecutar'!B49=\"si\",1-SUM(O50:R50),0)","v":0},0,null,null,null,null,null,null,null,null,null,null,1,{"$f":"+IF('Acciones a Ejecutar'!B49=\"si\",1,0)","v":0},{"$f":"+IF('Acciones a Ejecutar'!B49=\"si\",5,0)","v":0},null,{"$f":"IF('Acciones a Ejecutar'!$B49=\"si\",IF(OR(AI$7>Datos!$C$5,AND(AI$7=Datos!$C$5,Datos!$E$5<=Parametros!$D$37)),1,0),0)","v":0},{"$f":"IF('Acciones a Ejecutar'!$B49=\"si\",IF(OR(AJ$7>Datos!$C$5,AND(AJ$7=Datos!$C$5,Datos!$E$5<=Parametros!$D$37)),MAX(0,1-O50-Q50-R50),0),0)","v":0},{"$f":"IF('Acciones a Ejecutar'!$B49=\"si\",IF(OR(AK$7>Datos!$C$5,AND(AK$7=Datos!$C$5,Datos!$E$5<=Parametros!$D$37)),MAX(1-P50-R50-O50,0),0),0)","v":0},{"$f":"IF('Acciones a Ejecutar'!$B49=\"si\",IF(OR(AL$7>Datos!$C$5,AND(AL$7=Datos!$C$5,Datos!$E$5<=Parametros!$D$37)),MAX(1-Q50-O50-P50,0),0),0)","v":0}]
[null,{"$f":"+'Detalle evaluacion'!B52","v":"Sistema de Información Geográfica"},{"$f":"+'Detalle evaluacion'!C52","v":0},{"$f":"+'Detalle evaluacion'!D52","v":0},{"$f":"+'Detalle evaluacion'!E52","v":0},{"$f":"+'Detalle evaluacion'!F52","v":0},{"$f":"+'Detalle evaluacion'!G52","v":0},0,null,"Sistema de Información Geográfica",{"$f":"+NPV('Datos basicos'!$B$8,C51:G51)","v":0},0,{"$f":"IFERROR(IRR('Detalle evaluacion'!C220:V220),0)","v":0},{"$f":"+NPV('Datos basicos'!$B$8,'Detalle evaluacion'!C220:V220)","v":0},null,null,null,null,{"$f":"+IF('Acciones a Ejecutar'!B50=\"si\",1-SUM(O51:R51),0)","v":0},0,null,null,null,null,null,null,null,null,null,null,1,{"$f":"+IF('Acciones a Ejecutar'!B50=\"si\",1,0)","v":0},{"$f":"+IF('Acciones a Ejecutar'!B50=\"si\",5,0)","v":0},null,{"$f":"IF('Acciones a Ejecutar'!$B50=\"si\",IF(OR(AI$7>Datos!$C$5,AND(AI$7=Datos!$C$5,Datos!$E$5<=Parametros!$D$37)),1,0),0)","v":0},{"$f":"IF('Acciones a Ejecutar'!$B50=\"si\",IF(OR(AJ$7>Datos!$C$5,AND(AJ$7=Datos!$C$5,Datos!$E$5<=Parametros!$D$37)),MAX(0,1-O51-Q51-R51),0),0)","v":0},{"$f":"IF('Acciones a Ejecutar'!$B50=\"si\",IF(OR(AK$7>Datos!$C$5,AND(AK$7=Datos!$C$5,Datos!$E$5<=Parametros!$D$37)),MAX(1-P51-R51-O51,0),0),0)","v":0},{"$f":"IF('Acciones a Ejecutar'!$B50=\"si\",IF(OR(AL$7>Datos!$C$5,AND(AL$7=Datos!$C$5,Datos!$E$5<=Parametros!$D$37)),MAX(1-Q51-O51-P51,0),0),0)","v":0}]
[null,{"$f":"+'Detalle evaluacion'!B53","v":"Total PAI de reducciòn de Pérdidas Físicas de Agua"},{"$f":"+SUM(C40:C51)","v":0},0,0,0,0,0,null,"Total PAI de reducciòn de Pérdidas Físicas de Agua",{"$f":"+NPV('Datos basicos'!$B$8,C52:G52)","v":0},0,{"$f":"IFERROR(IRR('Detalle evaluacion'!C221:V221),0)","v":0},{"$f":"+NPV('Datos basicos'!$B$8,'Detalle evaluacion'!C221:V221)","v":0}]
[null,{"$f":"+'Detalle evaluacion'!B54","v":"5. PAI para sostenibilidad a las acciones "},null,null,null,null,null,null,null,"5. PAI para sostenibilidad a las acciones "]
[null,{"$f":"+'Detalle evaluacion'!B55","v":"Establecimiento de un comité ciudadano del organismo operador"},{"$f":"+'Detalle evaluacion'!C55","v":0},{"$f":"+'Detalle evaluacion'!D55","v":0},{"$f":"+'Detalle evaluacion'!E55","v":0},{"$f":"+'Detalle evaluacion'!F55","v":0},{"$f":"+'Detalle evaluacion'!G55","v":0},{"$f":"SUM(C54:G54)","v":0},null,"Establecimiento de un comité ciudadano del organismo operador",{"$f":"+NPV('Datos basicos'!$B$8,C54:G54)","v":0},null,null,null,null,null,null,null,{"$f":"+IF('Acciones a Ejecutar'!B53=\"si\",1-SUM(O54:R54),0)","v":0},{"$f":"+SUM(O54:S54)","v":0},null,null,null,null,null,null,null,null,null,null,{"$f":"1-SUM(P54:R54)","v":1},{"$f":"+IF('Acciones a Ejecutar'!B53=\"si\",1,0)","v":0},{"$f":"+IF('Acciones a Ejecutar'!B53=\"si\",5,0)","v":0},null,{"$f":"IF('Acciones a Ejecutar'!$B53=\"si\",IF(OR(AI$7>Datos!$C$5,AND(AI$7=Datos!$C$5,Datos!$E$5<=Parametros!$D$37)),1,0),0)","v":0},{"$f":"IF('Acciones a Ejecutar'!$B53=\"si\",IF(OR(AJ$7>Datos!$C$5,AND(AJ$7=Datos!$C$5,Datos!$E$5<=Parametros!$D$37)),MAX(0,1-O54-Q54-R54),0),0)","v":0},{"$f":"IF('Acciones a Ejecutar'!$B53=\"si\",IF(OR(AK$7>Datos!$C$5,AND(AK$7=Datos!$C$5,Datos!$E$5<=Parametros!$D$37)),MAX(1-P54-R54-O54,0),0),0)","v":0},{"$f":"IF('Acciones a Ejecutar'!$B53=\"si\",IF(OR(AL$7>Datos!$C$5,AND(AL$7=Datos!$C$5,Datos!$E$5<=Parametros!$D$37)),MAX(1-Q54-O54-P54,0),0),0)","v":0}]
[null,{"$f":"+'Detalle evaluacion'!B56","v":"Elaboración de un código de ética y suscripción por parte del personal del OO"},{"$f":"+'Detalle evaluacion'!C56","v":0},{"$f":"+'Detalle evaluacion'!D56","v":0},{"$f":"+'Detalle evaluacion'!E56","v":0},{"$f":"+'Detalle evaluacion'!F56","v":0},{"$f":"+'Detalle evaluacion'!G56","v":0},{"$f":"SUM(C55:G55)","v":0},null,"Elaboración de un código de ética y suscripción por parte del personal del OO",{"$f":"+NPV('Datos basicos'!$B$8,C55:G55)","v":0},null,null,null,null,null,null,null,{"$f":"+IF('Acciones a Ejecutar'!B54=\"si\",1-SUM(O55:R55),0)","v":0},{"$f":"+SUM(O55:S55)","v":0},null,null,null,null,null,null,null,null,null,null,{"$f":"1-SUM(P55:R55)","v":1},{"$f":"+IF('Acciones a Ejecutar'!B54=\"si\",1,0)","v":0},{"$f":"+IF('Acciones a Ejecutar'!B54=\"si\",5,0)","v":0},null,{"$f":"IF('Acciones a Ejecutar'!$B54=\"si\",IF(OR(AI$7>Datos!$C$5,AND(AI$7=Datos!$C$5,Datos!$E$5<=Parametros!$D$37)),1,0),0)","v":0},{"$f":"IF('Acciones a Ejecutar'!$B54=\"si\",IF(OR(AJ$7>Datos!$C$5,AND(AJ$7=Datos!$C$5,Datos!$E$5<=Parametros!$D$37)),MAX(0,1-O55-Q55-R55),0),0)","v":0},{"$f":"IF('Acciones a Ejecutar'!$B54=\"si\",IF(OR(AK$7>Datos!$C$5,AND(AK$7=Datos!$C$5,Datos!$E$5<=Parametros!$D$37)),MAX(1-P55-R55-O55,0),0),0)","v":0},{"$f":"IF('Acciones a Ejecutar'!$B54=\"si\",IF(OR(AL$7>Datos!$C$5,AND(AL$7=Datos!$C$5,Datos!$E$5<=Parametros!$D$37)),MAX(1-Q55-O55-P55,0),0),0)","v":0}]
[null,{"$f":"+'Detalle evaluacion'!B57","v":"Sistema informático de contabilidad"},{"$f":"+'Detalle evaluacion'!C57","v":0},{"$f":"+'Detalle evaluacion'!D57","v":0},{"$f":"+'Detalle evaluacion'!E57","v":0},{"$f":"+'Detalle evaluacion'!F57","v":0},{"$f":"+'Detalle evaluacion'!G57","v":0},{"$f":"SUM(C56:G56)","v":0},null,"Sistema informático de contabilidad",{"$f":"+NPV('Datos basicos'!$B$8,C56:G56)","v":0},null,null,null,null,null,null,null,{"$f":"+IF('Acciones a Ejecutar'!B55=\"si\",1-SUM(O56:R56),0)","v":0},{"$f":"+SUM(O56:S56)","v":0},null,null,null,null,null,null,null,null,null,null,{"$f":"1-SUM(P56:R56)","v":1},{"$f":"+IF('Acciones a Ejecutar'!B55=\"si\",1,0)","v":0},{"$f":"+IF('Acciones a Ejecutar'!B55=\"si\",5,0)","v":0},null,{"$f":"IF('Acciones a Ejecutar'!$B55=\"si\",IF(OR(AI$7>Datos!$C$5,AND(AI$7=Datos!$C$5,Datos!$E$5<=Parametros!$D$37)),1,0),0)","v":0},{"$f":"IF('Acciones a Ejecutar'!$B55=\"si\",IF(OR(AJ$7>Datos!$C$5,AND(AJ$7=Datos!$C$5,Datos!$E$5<=Parametros!$D$37)),MAX(0,1-O56-Q56-R56),0),0)","v":0},{"$f":"IF('Acciones a Ejecutar'!$B55=\"si\",IF(OR(AK$7>Datos!$C$5,AND(AK$7=Datos!$C$5,Datos!$E$5<=Parametros!$D$37)),MAX(1-P56-R56-O56,0),0),0)","v":0},{"$f":"IF('Acciones a Ejecutar'!$B55=\"si\",IF(OR(AL$7>Datos!$C$5,AND(AL$7=Datos!$C$5,Datos!$E$5<=Parametros!$D$37)),MAX(1-Q56-O56-P56,0),0),0)","v":0}]
[null,{"$f":"+'Detalle evaluacion'!B58","v":"Sistema de planeación Integral"},{"$f":"+'Detalle evaluacion'!C58","v":0},{"$f":"+'Detalle evaluacion'!D58","v":0},{"$f":"+'Detalle evaluacion'!E58","v":0},{"$f":"+'Detalle evaluacion'!F58","v":0},{"$f":"+'Detalle evaluacion'!G58","v":0},{"$f":"SUM(C57:G57)","v":0},null,"Sistema de planeación Integral",{"$f":"+NPV('Datos basicos'!$B$8,C57:G57)","v":0},null,null,null,null,null,null,null,{"$f":"+IF('Acciones a Ejecutar'!B56=\"si\",1-SUM(O57:R57),0)","v":0},{"$f":"+SUM(O57:S57)","v":0},null,null,null,null,null,null,null,null,null,null,{"$f":"1-SUM(P57:R57)","v":1},{"$f":"+IF('Acciones a Ejecutar'!B56=\"si\",1,0)","v":0},{"$f":"+IF('Acciones a Ejecutar'!B56=\"si\",5,0)","v":0},null,{"$f":"IF('Acciones a Ejecutar'!$B56=\"si\",IF(OR(AI$7>Datos!$C$5,AND(AI$7=Datos!$C$5,Datos!$E$5<=Parametros!$D$37)),1,0),0)","v":0},{"$f":"IF('Acciones a Ejecutar'!$B56=\"si\",IF(OR(AJ$7>Datos!$C$5,AND(AJ$7=Datos!$C$5,Datos!$E$5<=Parametros!$D$37)),MAX(0,1-O57-Q57-R57),0),0)","v":0},{"$f":"IF('Acciones a Ejecutar'!$B56=\"si\",IF(OR(AK$7>Datos!$C$5,AND(AK$7=Datos!$C$5,Datos!$E$5<=Parametros!$D$37)),MAX(1-P57-R57-O57,0),0),0)","v":0},{"$f":"IF('Acciones a Ejecutar'!$B56=\"si\",IF(OR(AL$7>Datos!$C$5,AND(AL$7=Datos!$C$5,Datos!$E$5<=Parametros!$D$37)),MAX(1-Q57-O57-P57,0),0),0)","v":0}]
[null,{"$f":"+'Detalle evaluacion'!B59","v":"Asesoría para financiamiento de contraparte"},{"$f":"+'Detalle evaluacion'!C59","v":0},{"$f":"+'Detalle evaluacion'!D59","v":0},{"$f":"+'Detalle evaluacion'!E59","v":0},{"$f":"+'Detalle evaluacion'!F59","v":0},{"$f":"+'Detalle evaluacion'!G59","v":0},{"$f":"SUM(C58:G58)","v":0},null,"Asesoría para financiamiento de contraparte",{"$f":"+NPV('Datos basicos'!$B$8,C58:G58)","v":0},null,null,null,null,null,null,null,{"$f":"+IF('Acciones a Ejecutar'!B57=\"si\",1-SUM(O58:R58),0)","v":0},{"$f":"+SUM(O58:S58)","v":0},null,null,null,null,null,null,null,null,null,null,{"$f":"1-SUM(P58:R58)","v":1},{"$f":"+IF('Acciones a Ejecutar'!B57=\"si\",1,0)","v":0},{"$f":"+IF('Acciones a Ejecutar'!B57=\"si\",5,0)","v":0},null,{"$f":"IF('Acciones a Ejecutar'!$B57=\"si\",IF(OR(AI$7>Datos!$C$5,AND(AI$7=Datos!$C$5,Datos!$E$5<=Parametros!$D$37)),1,0),0)","v":0},{"$f":"IF('Acciones a Ejecutar'!$B57=\"si\",IF(OR(AJ$7>Datos!$C$5,AND(AJ$7=Datos!$C$5,Datos!$E$5<=Parametros!$D$37)),MAX(0,1-O58-Q58-R58),0),0)","v":0},{"$f":"IF('Acciones a Ejecutar'!$B57=\"si\",IF(OR(AK$7>Datos!$C$5,AND(AK$7=Datos!$C$5,Datos!$E$5<=Parametros!$D$37)),MAX(1-P58-R58-O58,0),0),0)","v":0},{"$f":"IF('Acciones a Ejecutar'!$B57=\"si\",IF(OR(AL$7>Datos!$C$5,AND(AL$7=Datos!$C$5,Datos!$E$5<=Parametros!$D$37)),MAX(1-Q58-O58-P58,0),0),0)","v":0}]
[null,{"$f":"+'Detalle evaluacion'!B60","v":"Total PAI para sostenibilidad a las acciones"},{"$f":"+SUM(C54:C58)","v":0},0,0,0,0,0,null,"Total PAI para sostenibilidad a las acciones",{"$f":"+NPV('Datos basicos'!$B$8,C59:G59)","v":0},null,null,null,null,null,null,null,null,null,null,null,null,null,null,null,null,null,null,null,null,{"$f":"+IF('Acciones a Ejecutar'!B58=\"si\",1,0)","v":0},{"$f":"+IF('Acciones a Ejecutar'!B58=\"si\",5,0)","v":0}]
[null,{"$f":"+'Detalle evaluacion'!B61","v":"Total PAIs"},{"$f":"+C59+C52+C38+C22+C17","v":0},0,0,0,0,0,null,"Total PAIs",{"$f":"+NPV('Datos basicos'!$B$8,C60:G60)","v":0},{"$f":"IFERROR(N60/K60,0)","v":0},{"$f":"IFERROR(IRR('Detalle evaluacion'!C229:V229),0)","v":0},{"$f":"+NPV('Datos basicos'!$B$8,'Detalle evaluacion'!C229:V229)","v":0}]

{"sheet":"Calendarizacion","index":32,"n_rows":121,"n_cols":8,"rows_kept":121,"cut":false,"hidden":true,"merged":[[3,2,3,13],[4,2,4,13]]}
[]
[null,"Formato Evaluación 8. EVALUACION DE LOS PDI - CALENDARIZACION (PRIORIZACION)"]
[]
[null,"NOMBRE:",{"$f":"+'Acciones a Ejecutar'!B4","v":"X"}]
[null,"AÑO:",{"$f":"+'Acciones a Ejecutar'!B5","v":0}]
[]
[null,{"$f":"+'Detalle evaluacion'!B8","v":"Inversiones PAI  (Millones de pesos)"},{"$f":"+Datos!C6+1","v":1},{"$f":"+C7+1","v":2},{"$f":"+D7+1","v":3},{"$f":"+E7+1","v":4},{"$f":"+F7+1","v":5},"TOTAL"]
[null,{"$f":"+Evaluacion!J8","v":"1. PAI para reducir gastos de energía eléctrica"}]
[null,{"$f":"+Evaluacion!J9","v":"Solicitud de cambio de tarifa eléctrica para reducir gasto por concepto de energía eléctrica."},{"$f":"+IF('Acciones a Ejecutar'!$B8=\"SI\",Evaluacion!O9*Evaluacion!$H9,0)","v":0},{"$f":"+IF('Acciones a Ejecutar'!$B8=\"SI\",Evaluacion!P9*Evaluacion!$H9,0)","v":0},{"$f":"+IF('Acciones a Ejecutar'!$B8=\"SI\",Evaluacion!Q9*Evaluacion!$H9,0)","v":0},{"$f":"+IF('Acciones a Ejecutar'!$B8=\"SI\",Evaluacion!R9*Evaluacion!$H9,0)","v":0},{"$f":"+IF('Acciones a Ejecutar'!$B8=\"SI\",Evaluacion!S9*Evaluacion!$H9,0)","v":0},{"$f":"SUM(C9:G9)","v":0}]
[null,{"$f":"+Evaluacion!J10","v":"Reducción de la potencia reactiva (reducción del factor de potencia)"},{"$f":"+IF('Acciones a Ejecutar'!$B9=\"SI\",Evaluacion!O10*Evaluacion!$H10,0)","v":0},{"$f":"+IF('Acciones a Ejecutar'!$B9=\"SI\",Evaluacion!P10*Evaluacion!$H10,0)","v":0},{"$f":"+IF('Acciones a Ejecutar'!$B9=\"SI\",Evaluacion!Q10*Evaluacion!$H10,0)","v":0},{"$f":"+IF('Acciones a Ejecutar'!$B9=\"SI\",Evaluacion!R10*Evaluacion!$H10,0)","v":0},{"$f":"+IF('Acciones a Ejecutar'!$B9=\"SI\",Evaluacion!S10*Evaluacion!$H10,0)","v":0},0]
[null,{"$f":"+Evaluacion!J11","v":"Sustitución de equipos de bombeo de agua potable para reducir consumo de energía"},{"$f":"+IF('Acciones a Ejecutar'!$B10=\"SI\",Evaluacion!O11*Evaluacion!$H11,0)","v":0},{"$f":"+IF('Acciones a Ejecutar'!$B10=\"SI\",Evaluacion!P11*Evaluacion!$H11,0)","v":0},{"$f":"+IF('Acciones a Ejecutar'!$B10=\"SI\",Evaluacion!Q11*Evaluacion!$H11,0)","v":0},{"$f":"+IF('Acciones a Ejecutar'!$B10=\"SI\",Evaluacion!R11*Evaluacion!$H11,0)","v":0},{"$f":"+IF('Acciones a Ejecutar'!$B10=\"SI\",Evaluacion!S11*Evaluacion!$H11,0)","v":0},0]
[null,{"$f":"+Evaluacion!J12","v":"Sustitución o construcción de tanques de almacenamiento de agua para modificar políticas de operación del equipo de bombeo"},{"$f":"+IF('Acciones a Ejecutar'!$B11=\"SI\",Evaluacion!O12*Evaluacion!$H12,0)","v":0},{"$f":"+IF('Acciones a Ejecutar'!$B11=\"SI\",Evaluacion!P12*Evaluacion!$H12,0)","v":0},{"$f":"+IF('Acciones a Ejecutar'!$B11=\"SI\",Evaluacion!Q12*Evaluacion!$H12,0)","v":0},{"$f":"+IF('Acciones a Ejecutar'!$B11=\"SI\",Evaluacion!R12*Evaluacion!$H12,0)","v":0},{"$f":"+IF('Acciones a Ejecutar'!$B11=\"SI\",Evaluacion!S12*Evaluacion!$H12,0)","v":0},0]
[null,{"$f":"+Evaluacion!J13","v":"Automatización de equipos de bombeo para modificar políticas de operación"},{"$f":"+IF('Acciones a Ejecutar'!$B12=\"SI\",Evaluacion!O13*Evaluacion!$H13,0)","v":0},{"$f":"+IF('Acciones a Ejecutar'!$B12=\"SI\",Evaluacion!P13*Evaluacion!$H13,0)","v":0},{"$f":"+IF('Acciones a Ejecutar'!$B12=\"SI\",Evaluacion!Q13*Evaluacion!$H13,0)","v":0},{"$f":"+IF('Acciones a Ejecutar'!$B12=\"SI\",Evaluacion!R13*Evaluacion!$H13,0)","v":0},{"$f":"+IF('Acciones a Ejecutar'!$B12=\"SI\",Evaluacion!S13*Evaluacion!$H13,0)","v":0},0]
[null,{"$f":"+Evaluacion!J14","v":"Sustitución de bombas de alcantarillado"},{"$f":"+IF('Acciones a Ejecutar'!$B13=\"SI\",Evaluacion!O14*Evaluacion!$H14,0)","v":0},{"$f":"+IF('Acciones a Ejecutar'!$B13=\"SI\",Evaluacion!P14*Evaluacion!$H14,0)","v":0},{"$f":"+IF('Acciones a Ejecutar'!$B13=\"SI\",Evaluacion!Q14*Evaluacion!$H14,0)","v":0},{"$f":"+IF('Acciones a Ejecutar'!$B13=\"SI\",Evaluacion!R14*Evaluacion!$H14,0)","v":0},{"$f":"+IF('Acciones a Ejecutar'!$B13=\"SI\",Evaluacion!S14*Evaluacion!$H14,0)","v":0},0]
[null,{"$f":"+Evaluacion!J15","v":"Reducción de gastos de energía en plantas de tratamiento de aguas residuales (PTAR)"},{"$f":"+IF('Acciones a Ejecutar'!$B14=\"SI\",Evaluacion!O15*Evaluacion!$H15,0)","v":0},{"$f":"+IF('Acciones a Ejecutar'!$B14=\"SI\",Evaluacion!P15*Evaluacion!$H15,0)","v":0},{"$f":"+IF('Acciones a Ejecutar'!$B14=\"SI\",Evaluacion!Q15*Evaluacion!$H15,0)","v":0},{"$f":"+IF('Acciones a Ejecutar'!$B14=\"SI\",Evaluacion!R15*Evaluacion!$H15,0)","v":0},{"$f":"+IF('Acciones a Ejecutar'!$B14=\"SI\",Evaluacion!S15*Evaluacion!$H15,0)","v":0},0]
[null,{"$f":"+Evaluacion!J16","v":"Elaboración de una auditoría energética"},{"$f":"+IF('Acciones a Ejecutar'!$B15=\"SI\",Evaluacion!O16*Evaluacion!$H16,0)","v":0},{"$f":"+IF('Acciones a Ejecutar'!$B15=\"SI\",Evaluacion!P16*Evaluacion!$H16,0)","v":0},{"$f":"+IF('Acciones a Ejecutar'!$B15=\"SI\",Evaluacion!Q16*Evaluacion!$H16,0)","v":0},{"$f":"+IF('Acciones a Ejecutar'!$B15=\"SI\",Evaluacion!R16*Evaluacion!$H16,0)","v":0},{"$f":"+IF('Acciones a Ejecutar'!$B15=\"SI\",Evaluacion!S16*Evaluacion!$H16,0)","v":0},0]
[null,{"$f":"+Evaluacion!J17","v":"Total Inversión PAI para reducción de gastos de energía eléctrica"},{"$f":"SUM(C9:C16)","v":0},{"$f":"SUM(D9:D16)","v":0},{"$f":"SUM(E9:E16)","v":0},{"$f":"SUM(F9:F16)","v":0},{"$f":"SUM(G9:G16)","v":0},0]
[null,{"$f":"+Evaluacion!J18","v":"2. PAI para incrementar la productividad del personal "}]
[null,{"$f":"+Evaluacion!J19","v":"Programa de capacitación y profesionalización para incrementar la productividad del personal."},{"$f":"+IF('Acciones a Ejecutar'!$B18=\"SI\",Evaluacion!O19*Evaluacion!$H19,0)","v":0},{"$f":"+IF('Acciones a Ejecutar'!$B18=\"SI\",Evaluacion!P19*Evaluacion!$H19,0)","v":0},{"$f":"+IF('Acciones a Ejecutar'!$B18=\"SI\",Evaluacion!Q19*Evaluacion!$H19,0)","v":0},{"$f":"+IF('Acciones a Ejecutar'!$B18=\"SI\",Evaluacion!R19*Evaluacion!$H19,0)","v":0},{"$f":"+IF('Acciones a Ejecutar'!$B18=\"SI\",Evaluacion!S19*Evaluacion!$H19,0)","v":0},{"$f":"SUM(C19:G19)","v":0}]
[null,{"$f":"+Evaluacion!J20","v":"Revisión del manual de funciones y cargos del personal del OO"},{"$f":"+IF('Acciones a Ejecutar'!$B19=\"SI\",Evaluacion!O20*Evaluacion!$H20,0)","v":0},{"$f":"+IF('Acciones a Ejecutar'!$B19=\"SI\",Evaluacion!P20*Evaluacion!$H20,0)","v":0},{"$f":"+IF('Acciones a Ejecutar'!$B19=\"SI\",Evaluacion!Q20*Evaluacion!$H20,0)","v":0},{"$f":"+IF('Acciones a Ejecutar'!$B19=\"SI\",Evaluacion!R20*Evaluacion!$H20,0)","v":0},{"$f":"+IF('Acciones a Ejecutar'!$B19=\"SI\",Evaluacion!S20*Evaluacion!$H20,0)","v":0},0]
[null,{"$f":"+Evaluacion!J21","v":"Establecimiento de un programa de retiro voluntario y obligado"},{"$f":"+IF('Acciones a Ejecutar'!$B20=\"SI\",Evaluacion!O21*Evaluacion!$H21,0)","v":0},{"$f":"+IF('Acciones a Ejecutar'!$B20=\"SI\",Evaluacion!P21*Evaluacion!$H21,0)","v":0},{"$f":"+IF('Acciones a Ejecutar'!$B20=\"SI\",Evaluacion!Q21*Evaluacion!$H21,0)","v":0},{"$f":"+IF('Acciones a Ejecutar'!$B20=\"SI\",Evaluacion!R21*Evaluacion!$H21,0)","v":0},{"$f":"+IF('Acciones a Ejecutar'!$B20=\"SI\",Evaluacion!S21*Evaluacion!$H21,0)","v":0},0]
[null,{"$f":"+Evaluacion!J22","v":"Total Inversión PAI para incrementar la productividad del personal"},{"$f":"SUM(C19:C21)","v":0},{"$f":"SUM(D19:D21)","v":0},{"$f":"SUM(E19:E21)","v":0},{"$f":"SUM(F19:F21)","v":0},{"$f":"SUM(G19:G21)","v":0},0]
[null,{"$f":"+Evaluacion!J23","v":"3. PAI para mejora de la Gestión Comercial"}]
[null,{"$f":"+Evaluacion!J24","v":"Ajuste de consumos de cuota fija"},{"$f":"+IF('Acciones a Ejecutar'!$B23=\"SI\",Evaluacion!O24*Evaluacion!$H24,0)","v":0},{"$f":"+IF('Acciones a Ejecutar'!$B23=\"SI\",Evaluacion!P24*Evaluacion!$H24,0)","v":0},{"$f":"+IF('Acciones a Ejecutar'!$B23=\"SI\",Evaluacion!Q24*Evaluacion!$H24,0)","v":0},{"$f":"+IF('Acciones a Ejecutar'!$B23=\"SI\",Evaluacion!R24*Evaluacion!$H24,0)","v":0},{"$f":"+IF('Acciones a Ejecutar'!$B23=\"SI\",Evaluacion!S24*Evaluacion!$H24,0)","v":0},0]
[null,{"$f":"+Evaluacion!J25","v":"Corrección de errores de micromedición mediante sustitución de medidores."},{"$f":"+IF('Acciones a Ejecutar'!$B24=\"SI\",Evaluacion!O25*Evaluacion!$H25,0)","v":0},{"$f":"+IF('Acciones a Ejecutar'!$B24=\"SI\",Evaluacion!P25*Evaluacion!$H25,0)","v":0},{"$f":"+IF('Acciones a Ejecutar'!$B24=\"SI\",Evaluacion!Q25*Evaluacion!$H25,0)","v":0},{"$f":"+IF('Acciones a Ejecutar'!$B24=\"SI\",Evaluacion!R25*Evaluacion!$H25,0)","v":0},{"$f":"+IF('Acciones a Ejecutar'!$B24=\"SI\",Evaluacion!S25*Evaluacion!$H25,0)","v":0},0]
[null,{"$f":"+Evaluacion!J26","v":"Impartición de cursos de formación de recursos humanos en eficiencia comercial"},{"$f":"+IF('Acciones a Ejecutar'!$B25=\"SI\",Evaluacion!O26*Evaluacion!$H26,0)","v":0},{"$f":"+IF('Acciones a Ejecutar'!$B25=\"SI\",Evaluacion!P26*Evaluacion!$H26,0)","v":0},{"$f":"+IF('Acciones a Ejecutar'!$B25=\"SI\",Evaluacion!Q26*Evaluacion!$H26,0)","v":0},{"$f":"+IF('Acciones a Ejecutar'!$B25=\"SI\",Evaluacion!R26*Evaluacion!$H26,0)","v":0},{"$f":"+IF('Acciones a Ejecutar'!$B25=\"SI\",Evaluacion!S26*Evaluacion!$H26,0)","v":0},0]
[null,{"$f":"+Evaluacion!J27","v":"Impartición de cursos de formación de recursos humanos en atención a usuarios"},{"$f":"+IF('Acciones a Ejecutar'!$B26=\"SI\",Evaluacion!O27*Evaluacion!$H27,0)","v":0},{"$f":"+IF('Acciones a Ejecutar'!$B26=\"SI\",Evaluacion!P27*Evaluacion!$H27,0)","v":0},{"$f":"+IF('Acciones a Ejecutar'!$B26=\"SI\",Evaluacion!Q27*Evaluacion!$H27,0)","v":0},{"$f":"+IF('Acciones a Ejecutar'!$B26=\"SI\",Evaluacion!R27*Evaluacion!$H27,0)","v":0},{"$f":"+IF('Acciones a Ejecutar'!$B26=\"SI\",Evaluacion!S27*Evaluacion!$H27,0)","v":0},0]
[null,{"$f":"+Evaluacion!J28","v":"Firma de convenios con bancos y otras instituciones para ampliar las opciones de pago de los servicios de agua y saneamiento"},{"$f":"+IF('Acciones a Ejecutar'!$B27=\"SI\",Evaluacion!O28*Evaluacion!$H28,0)","v":0},{"$f":"+IF('Acciones a Ejecutar'!$B27=\"SI\",Evaluacion!P28*Evaluacion!$H28,0)","v":0},{"$f":"+IF('Acciones a Ejecutar'!$B27=\"SI\",Evaluacion!Q28*Evaluacion!$H28,0)","v":0},{"$f":"+IF('Acciones a Ejecutar'!$B27=\"SI\",Evaluacion!R28*Evaluacion!$H28,0)","v":0},{"$f":"+IF('Acciones a Ejecutar'!$B27=\"SI\",Evaluacion!S28*Evaluacion!$H28,0)","v":0},0]
[null,{"$f":"+Evaluacion!J29","v":"Mejoras a la facturación mediante un nuevo sistema comercial"},{"$f":"+IF('Acciones a Ejecutar'!$B28=\"SI\",Evaluacion!O29*Evaluacion!$H29,0)","v":0},{"$f":"+IF('Acciones a Ejecutar'!$B28=\"SI\",Evaluacion!P29*Evaluacion!$H29,0)","v":0},{"$f":"+IF('Acciones a Ejecutar'!$B28=\"SI\",Evaluacion!Q29*Evaluacion!$H29,0)","v":0},{"$f":"+IF('Acciones a Ejecutar'!$B28=\"SI\",Evaluacion!R29*Evaluacion!$H29,0)","v":0},{"$f":"+IF('Acciones a Ejecutar'!$B28=\"SI\",Evaluacion!S29*Evaluacion!$H29,0)","v":0},0]
[null,{"$f":"+Evaluacion!J30","v":"Mejoras en la cobranza mediante esquemas que faciliten el pago."},{"$f":"+IF('Acciones a Ejecutar'!$B29=\"SI\",Evaluacion!O30*Evaluacion!$H30,0)","v":0},{"$f":"+IF('Acciones a Ejecutar'!$B29=\"SI\",Evaluacion!P30*Evaluacion!$H30,0)","v":0},{"$f":"+IF('Acciones a Ejecutar'!$B29=\"SI\",Evaluacion!Q30*Evaluacion!$H30,0)","v":0},{"$f":"+IF('Acciones a Ejecutar'!$B29=\"SI\",Evaluacion!R30*Evaluacion!$H30,0)","v":0},{"$f":"+IF('Acciones a Ejecutar'!$B29=\"SI\",Evaluacion!S30*Evaluacion!$H30,0)","v":0},0]
[null,{"$f":"+Evaluacion!J31","v":"Localización y regularización de tomas clandestinas"},{"$f":"+IF('Acciones a Ejecutar'!$B30=\"SI\",Evaluacion!O31*Evaluacion!$H31,0)","v":0},{"$f":"+IF('Acciones a Ejecutar'!$B30=\"SI\",Evaluacion!P31*Evaluacion!$H31,0)","v":0},{"$f":"+IF('Acciones a Ejecutar'!$B30=\"SI\",Evaluacion!Q31*Evaluacion!$H31,0)","v":0},{"$f":"+IF('Acciones a Ejecutar'!$B30=\"SI\",Evaluacion!R31*Evaluacion!$H31,0)","v":0},{"$f":"+IF('Acciones a Ejecutar'!$B30=\"SI\",Evaluacion!S31*Evaluacion!$H31,0)","v":0},0]
[null,{"$f":"+Evaluacion!J32","v":"Censo de usuarios para mejorar el padrón. Establecimiento de esquemas de actualización continua del padrón."},{"$f":"+IF('Acciones a Ejecutar'!$B31=\"SI\",Evaluacion!O32*Evaluacion!$H32,0)","v":0},{"$f":"+IF('Acciones a Ejecutar'!$B31=\"SI\",Evaluacion!P32*Evaluacion!$H32,0)","v":0},{"$f":"+IF('Acciones a Ejecutar'!$B31=\"SI\",Evaluacion!Q32*Evaluacion!$H32,0)","v":0},{"$f":"+IF('Acciones a Ejecutar'!$B31=\"SI\",Evaluacion!R32*Evaluacion!$H32,0)","v":0},{"$f":"+IF('Acciones a Ejecutar'!$B31=\"SI\",Evaluacion!S32*Evaluacion!$H32,0)","v":0},0]
[null,{"$f":"+Evaluacion!J33","v":"Sistema de cómputo para altas y bajas del padrón de usuarios."},{"$f":"+IF('Acciones a Ejecutar'!$B32=\"SI\",Evaluacion!O33*Evaluacion!$H33,0)","v":0},{"$f":"+IF('Acciones a Ejecutar'!$B32=\"SI\",Evaluacion!P33*Evaluacion!$H33,0)","v":0},{"$f":"+IF('Acciones a Ejecutar'!$B32=\"SI\",Evaluacion!Q33*Evaluacion!$H33,0)","v":0},{"$f":"+IF('Acciones a Ejecutar'!$B32=\"SI\",Evaluacion!R33*Evaluacion!$H33,0)","v":0},{"$f":"+IF('Acciones a Ejecutar'!$B32=\"SI\",Evaluacion!S33*Evaluacion!$H33,0)","v":0},0]
[null,{"$f":"+Evaluacion!J34","v":"Estudio tarifario con el fin de realizar la actualización de las tarifas de agua"},{"$f":"+IF('Acciones a Ejecutar'!$B33=\"SI\",Evaluacion!O34*Evaluacion!$H34,0)","v":0},{"$f":"+IF('Acciones a Ejecutar'!$B33=\"SI\",Evaluacion!P34*Evaluacion!$H34,0)","v":0},{"$f":"+IF('Acciones a Ejecutar'!$B33=\"SI\",Evaluacion!Q34*Evaluacion!$H34,0)","v":0},{"$f":"+IF('Acciones a Ejecutar'!$B33=\"SI\",Evaluacion!R34*Evaluacion!$H34,0)","v":0},{"$f":"+IF('Acciones a Ejecutar'!$B33=\"SI\",Evaluacion!S34*Evaluacion!$H34,0)","v":0},0]
[null,{"$f":"+Evaluacion!J35","v":"Modificaciones a la estructura tarifaria"},{"$f":"+IF('Acciones a Ejecutar'!$B34=\"SI\",Evaluacion!O35*Evaluacion!$H35,0)","v":0},{"$f":"+IF('Acciones a Ejecutar'!$B34=\"SI\",Evaluacion!P35*Evaluacion!$H35,0)","v":0},{"$f":"+IF('Acciones a Ejecutar'!$B34=\"SI\",Evaluacion!Q35*Evaluacion!$H35,0)","v":0},{"$f":"+IF('Acciones a Ejecutar'!$B34=\"SI\",Evaluacion!R35*Evaluacion!$H35,0)","v":0},{"$f":"+IF('Acciones a Ejecutar'!$B34=\"SI\",Evaluacion!S35*Evaluacion!$H35,0)","v":0},0]
[null,{"$f":"+Evaluacion!J36","v":"Reformas para lograr que las tarifas se actualicen de manera continua"},{"$f":"+IF('Acciones a Ejecutar'!$B35=\"SI\",Evaluacion!O36*Evaluacion!$H36,0)","v":0},{"$f":"+IF('Acciones a Ejecutar'!$B35=\"SI\",Evaluacion!P36*Evaluacion!$H36,0)","v":0},{"$f":"+IF('Acciones a Ejecutar'!$B35=\"SI\",Evaluacion!Q36*Evaluacion!$H36,0)","v":0},{"$f":"+IF('Acciones a Ejecutar'!$B35=\"SI\",Evaluacion!R36*Evaluacion!$H36,0)","v":0},{"$f":"+IF('Acciones a Ejecutar'!$B35=\"SI\",Evaluacion!S36*Evaluacion!$H36,0)","v":0},0]
[null,{"$f":"+Evaluacion!J37","v":"Reformas al marco legal para que el OO pueda establecer tarifas adecuadas"},{"$f":"+IF('Acciones a Ejecutar'!$B36=\"SI\",Evaluacion!O37*Evaluacion!$H37,0)","v":0},{"$f":"+IF('Acciones a Ejecutar'!$B36=\"SI\",Evaluacion!P37*Evaluacion!$H37,0)","v":0},{"$f":"+IF('Acciones a Ejecutar'!$B36=\"SI\",Evaluacion!Q37*Evaluacion!$H37,0)","v":0},{"$f":"+IF('Acciones a Ejecutar'!$B36=\"SI\",Evaluacion!R37*Evaluacion!$H37,0)","v":0},{"$f":"+IF('Acciones a Ejecutar'!$B36=\"SI\",Evaluacion!S37*Evaluacion!$H37,0)","v":0},0]
[null,{"$f":"+Evaluacion!J38","v":"Total PAI para mejora de la Gestión Comercial"},{"$f":"SUM(C24:C37)","v":0},{"$f":"SUM(D24:D37)","v":0},{"$f":"SUM(E24:E37)","v":0},{"$f":"SUM(F24:F37)","v":0},{"$f":"SUM(G24:G37)","v":0},0]
[null,{"$f":"+Evaluacion!J39","v":"4. PAI para reducción de Pérdidas Físicas de Agua"}]
[null,{"$f":"+Evaluacion!J40","v":"Localización y reparación de fugas en tanques"},{"$f":"+IF('Acciones a Ejecutar'!$B39=\"SI\",Evaluacion!O40*Evaluacion!$H40,0)","v":0},{"$f":"+IF('Acciones a Ejecutar'!$B39=\"SI\",Evaluacion!P40*Evaluacion!$H40,0)","v":0},{"$f":"+IF('Acciones a Ejecutar'!$B39=\"SI\",Evaluacion!Q40*Evaluacion!$H40,0)","v":0},{"$f":"+IF('Acciones a Ejecutar'!$B39=\"SI\",Evaluacion!R40*Evaluacion!$H40,0)","v":0},{"$f":"+IF('Acciones a Ejecutar'!$B39=\"SI\",Evaluacion!S40*Evaluacion!$H40,0)","v":0},{"$f":"SUM(C40:G40)","v":0}]
[null,{"$f":"+Evaluacion!J41","v":"Localización y reparación de fugas en tuberías principales y secundarias"},{"$f":"+IF('Acciones a Ejecutar'!$B40=\"SI\",Evaluacion!O41*Evaluacion!$H41,0)","v":0},{"$f":"+IF('Acciones a Ejecutar'!$B40=\"SI\",Evaluacion!P41*Evaluacion!$H41,0)","v":0},{"$f":"+IF('Acciones a Ejecutar'!$B40=\"SI\",Evaluacion!Q41*Evaluacion!$H41,0)","v":0},{"$f":"+IF('Acciones a Ejecutar'!$B40=\"SI\",Evaluacion!R41*Evaluacion!$H41,0)","v":0},{"$f":"+IF('Acciones a Ejecutar'!$B40=\"SI\",Evaluacion!S41*Evaluacion!$H41,0)","v":0},0]
[null,{"$f":"+Evaluacion!J42","v":"Instalación de micromedidores en las tomas"},{"$f":"+IF('Acciones a Ejecutar'!$B41=\"SI\",Evaluacion!O42*Evaluacion!$H42,0)","v":0},{"$f":"+IF('Acciones a Ejecutar'!$B41=\"SI\",Evaluacion!P42*Evaluacion!$H42,0)","v":0},{"$f":"+IF('Acciones a Ejecutar'!$B41=\"SI\",Evaluacion!Q42*Evaluacion!$H42,0)","v":0},{"$f":"+IF('Acciones a Ejecutar'!$B41=\"SI\",Evaluacion!R42*Evaluacion!$H42,0)","v":0},{"$f":"+IF('Acciones a Ejecutar'!$B41=\"SI\",Evaluacion!S42*Evaluacion!$H42,0)","v":0},0]
[null,{"$f":"+Evaluacion!J43","v":"Sistematización de lectura de micromedidores en tomas e incorporación de lecturas al sistema de facturación y cobranza"},{"$f":"+IF('Acciones a Ejecutar'!$B42=\"SI\",Evaluacion!O43*Evaluacion!$H43,0)","v":0},{"$f":"+IF('Acciones a Ejecutar'!$B42=\"SI\",Evaluacion!P43*Evaluacion!$H43,0)","v":0},{"$f":"+IF('Acciones a Ejecutar'!$B42=\"SI\",Evaluacion!Q43*Evaluacion!$H43,0)","v":0},{"$f":"+IF('Acciones a Ejecutar'!$B42=\"SI\",Evaluacion!R43*Evaluacion!$H43,0)","v":0},{"$f":"+IF('Acciones a Ejecutar'!$B42=\"SI\",Evaluacion!S43*Evaluacion!$H43,0)","v":0},0]
[null,{"$f":"+Evaluacion!J44","v":"Optimización hidráulica: sectorización de la red de distribución, control de presión, optimización de la capacidad de almacenamiento."},{"$f":"+IF('Acciones a Ejecutar'!$B43=\"SI\",Evaluacion!O44*Evaluacion!$H44,0)","v":0},{"$f":"+IF('Acciones a Ejecutar'!$B43=\"SI\",Evaluacion!P44*Evaluacion!$H44,0)","v":0},{"$f":"+IF('Acciones a Ejecutar'!$B43=\"SI\",Evaluacion!Q44*Evaluacion!$H44,0)","v":0},{"$f":"+IF('Acciones a Ejecutar'!$B43=\"SI\",Evaluacion!R44*Evaluacion!$H44,0)","v":0},{"$f":"+IF('Acciones a Ejecutar'!$B43=\"SI\",Evaluacion!S44*Evaluacion!$H44,0)","v":0},0]
[null,{"$f":"+Evaluacion!J45","v":"Catastro de infraestructura hidráulica y de redes"},{"$f":"+IF('Acciones a Ejecutar'!$B44=\"SI\",Evaluacion!O45*Evaluacion!$H45,0)","v":0},{"$f":"+IF('Acciones a Ejecutar'!$B44=\"SI\",Evaluacion!P45*Evaluacion!$H45,0)","v":0},{"$f":"+IF('Acciones a Ejecutar'!$B44=\"SI\",Evaluacion!Q45*Evaluacion!$H45,0)","v":0},{"$f":"+IF('Acciones a Ejecutar'!$B44=\"SI\",Evaluacion!R45*Evaluacion!$H45,0)","v":0},{"$f":"+IF('Acciones a Ejecutar'!$B44=\"SI\",Evaluacion!S45*Evaluacion!$H45,0)","v":0},0]
[null,{"$f":"+Evaluacion!J46","v":"Instalación de macromedidores en captaciones"},{"$f":"+IF('Acciones a Ejecutar'!$B45=\"SI\",Evaluacion!O46*Evaluacion!$H46,0)","v":0},{"$f":"+IF('Acciones a Ejecutar'!$B45=\"SI\",Evaluacion!P46*Evaluacion!$H46,0)","v":0},{"$f":"+IF('Acciones a Ejecutar'!$B45=\"SI\",Evaluacion!Q46*Evaluacion!$H46,0)","v":0},{"$f":"+IF('Acciones a Ejecutar'!$B45=\"SI\",Evaluacion!R46*Evaluacion!$H46,0)","v":0},{"$f":"+IF('Acciones a Ejecutar'!$B45=\"SI\",Evaluacion!S46*Evaluacion!$H46,0)","v":0},0]
[null,{"$f":"+Evaluacion!J47","v":"Instalación de macromedidores en sectores"},{"$f":"+IF('Acciones a Ejecutar'!$B46=\"SI\",Evaluacion!O47*Evaluacion!$H47,0)","v":0},{"$f":"+IF('Acciones a Ejecutar'!$B46=\"SI\",Evaluacion!P47*Evaluacion!$H47,0)","v":0},{"$f":"+IF('Acciones a Ejecutar'!$B46=\"SI\",Evaluacion!Q47*Evaluacion!$H47,0)","v":0},{"$f":"+IF('Acciones a Ejecutar'!$B46=\"SI\",Evaluacion!R47*Evaluacion!$H47,0)","v":0},{"$f":"+IF('Acciones a Ejecutar'!$B46=\"SI\",Evaluacion!S47*Evaluacion!$H47,0)","v":0},0]
[null,{"$f":"+Evaluacion!J48","v":"Sistematización de lectura de macromedidores en captaciones y sectores ( p.ej. a través de telemetría)"},{"$f":"+IF('Acciones a Ejecutar'!$B47=\"SI\",Evaluacion!O48*Evaluacion!$H48,0)","v":0},{"$f":"+IF('Acciones a Ejecutar'!$B47=\"SI\",Evaluacion!P48*Evaluacion!$H48,0)","v":0},{"$f":"+IF('Acciones a Ejecutar'!$B47=\"SI\",Evaluacion!Q48*Evaluacion!$H48,0)","v":0},{"$f":"+IF('Acciones a Ejecutar'!$B47=\"SI\",Evaluacion!R48*Evaluacion!$H48,0)","v":0},{"$f":"+IF('Acciones a Ejecutar'!$B47=\"SI\",Evaluacion!S48*Evaluacion!$H48,0)","v":0},0]
[null,{"$f":"+Evaluacion!J49","v":"Sustitución de tuberías con alto índice de fugas"},{"$f":"+IF('Acciones a Ejecutar'!$B48=\"SI\",Evaluacion!O49*Evaluacion!$H49,0)","v":0},{"$f":"+IF('Acciones a Ejecutar'!$B48=\"SI\",Evaluacion!P49*Evaluacion!$H49,0)","v":0},{"$f":"+IF('Acciones a Ejecutar'!$B48=\"SI\",Evaluacion!Q49*Evaluacion!$H49,0)","v":0},{"$f":"+IF('Acciones a Ejecutar'!$B48=\"SI\",Evaluacion!R49*Evaluacion!$H49,0)","v":0},{"$f":"+IF('Acciones a Ejecutar'!$B48=\"SI\",Evaluacion!S49*Evaluacion!$H49,0)","v":0},0]
[null,{"$f":"+Evaluacion!J50","v":"Capacitación del personal del OO en operación de equipos"},{"$f":"+IF('Acciones a Ejecutar'!$B49=\"SI\",Evaluacion!O50*Evaluacion!$H50,0)","v":0},{"$f":"+IF('Acciones a Ejecutar'!$B49=\"SI\",Evaluacion!P50*Evaluacion!$H50,0)","v":0},{"$f":"+IF('Acciones a Ejecutar'!$B49=\"SI\",Evaluacion!Q50*Evaluacion!$H50,0)","v":0},{"$f":"+IF('Acciones a Ejecutar'!$B49=\"SI\",Evaluacion!R50*Evaluacion!$H50,0)","v":0},{"$f":"+IF('Acciones a Ejecutar'!$B49=\"SI\",Evaluacion!S50*Evaluacion!$H50,0)","v":0},0]
[null,{"$f":"+Evaluacion!J51","v":"Sistema de Información Geográfica"},{"$f":"+IF('Acciones a Ejecutar'!$B50=\"SI\",Evaluacion!O51*Evaluacion!$H51,0)","v":0},{"$f":"+IF('Acciones a Ejecutar'!$B50=\"SI\",Evaluacion!P51*Evaluacion!$H51,0)","v":0},{"$f":"+IF('Acciones a Ejecutar'!$B50=\"SI\",Evaluacion!Q51*Evaluacion!$H51,0)","v":0},{"$f":"+IF('Acciones a Ejecutar'!$B50=\"SI\",Evaluacion!R51*Evaluacion!$H51,0)","v":0},{"$f":"+IF('Acciones a Ejecutar'!$B50=\"SI\",Evaluacion!S51*Evaluacion!$H51,0)","v":0},0]
[null,{"$f":"+Evaluacion!J52","v":"Total PAI de reducciòn de Pérdidas Físicas de Agua"},{"$f":"SUM(C40:C51)","v":0},{"$f":"SUM(D40:D51)","v":0},{"$f":"SUM(E40:E51)","v":0},{"$f":"SUM(F40:F51)","v":0},{"$f":"SUM(G40:G51)","v":0},0]
[null,{"$f":"+Evaluacion!J53","v":"5. PAI para sostenibilidad a las acciones "}]
[null,{"$f":"+Evaluacion!J54","v":"Establecimiento de un comité ciudadano del organismo operador"},{"$f":"+IF('Acciones a Ejecutar'!$B53=\"SI\",Evaluacion!O54*Evaluacion!$H54,0)","v":0},{"$f":"+IF('Acciones a Ejecutar'!$B53=\"SI\",Evaluacion!P54*Evaluacion!$H54,0)","v":0},{"$f":"+IF('Acciones a Ejecutar'!$B53=\"SI\",Evaluacion!Q54*Evaluacion!$H54,0)","v":0},{"$f":"+IF('Acciones a Ejecutar'!$B53=\"SI\",Evaluacion!R54*Evaluacion!$H54,0)","v":0},{"$f":"+IF('Acciones a Ejecutar'!$B53=\"SI\",Evaluacion!S54*Evaluacion!$H54,0)","v":0},{"$f":"SUM(C54:G54)","v":0}]
[null,{"$f":"+Evaluacion!J55","v":"Elaboración de un código de ética y suscripción por parte del personal del OO"},{"$f":"+IF('Acciones a Ejecutar'!$B54=\"SI\",Evaluacion!O55*Evaluacion!$H55,0)","v":0},{"$f":"+IF('Acciones a Ejecutar'!$B54=\"SI\",Evaluacion!P55*Evaluacion!$H55,0)","v":0},{"$f":"+IF('Acciones a Ejecutar'!$B54=\"SI\",Evaluacion!Q55*Evaluacion!$H55,0)","v":0},{"$f":"+IF('Acciones a Ejecutar'!$B54=\"SI\",Evaluacion!R55*Evaluacion!$H55,0)","v":0},{"$f":"+IF('Acciones a Ejecutar'!$B54=\"SI\",Evaluacion!S55*Evaluacion!$H55,0)","v":0},0]
[null,{"$f":"+Evaluacion!J56","v":"Sistema informático de contabilidad"},{"$f":"+IF('Acciones a Ejecutar'!$B55=\"SI\",Evaluacion!O56*Evaluacion!$H56,0)","v":0},{"$f":"+IF('Acciones a Ejecutar'!$B55=\"SI\",Evaluacion!P56*Evaluacion!$H56,0)","v":0},{"$f":"+IF('Acciones a Ejecutar'!$B55=\"SI\",Evaluacion!Q56*Evaluacion!$H56,0)","v":0},{"$f":"+IF('Acciones a Ejecutar'!$B55=\"SI\",Evaluacion!R56*Evaluacion!$H56,0)","v":0},{"$f":"+IF('Acciones a Ejecutar'!$B55=\"SI\",Evaluacion!S56*Evaluacion!$H56,0)","v":0},0]
[null,{"$f":"+Evaluacion!J57","v":"Sistema de planeación Integral"},{"$f":"+IF('Acciones a Ejecutar'!$B56=\"SI\",Evaluacion!O57*Evaluacion!$H57,0)","v":0},{"$f":"+IF('Acciones a Ejecutar'!$B56=\"SI\",Evaluacion!P57*Evaluacion!$H57,0)","v":0},{"$f":"+IF('Acciones a Ejecutar'!$B56=\"SI\",Evaluacion!Q57*Evaluacion!$H57,0)","v":0},{"$f":"+IF('Acciones a Ejecutar'!$B56=\"SI\",Evaluacion!R57*Evaluacion!$H57,0)","v":0},{"$f":"+IF('Acciones a Ejecutar'!$B56=\"SI\",Evaluacion!S57*Evaluacion!$H57,0)","v":0},0]
[null,{"$f":"+Evaluacion!J58","v":"Asesoría para financiamiento de contraparte"},{"$f":"+IF('Acciones a Ejecutar'!$B57=\"SI\",Evaluacion!O58*Evaluacion!$H58,0)","v":0},{"$f":"+IF('Acciones a Ejecutar'!$B57=\"SI\",Evaluacion!P58*Evaluacion!$H58,0)","v":0},{"$f":"+IF('Acciones a Ejecutar'!$B57=\"SI\",Evaluacion!Q58*Evaluacion!$H58,0)","v":0},{"$f":"+IF('Acciones a Ejecutar'!$B57=\"SI\",Evaluacion!R58*Evaluacion!$H58,0)","v":0},{"$f":"+IF('Acciones a Ejecutar'!$B57=\"SI\",Evaluacion!S58*Evaluacion!$H58,0)","v":0},0]
[null,{"$f":"+Evaluacion!J59","v":"Total PAI para sostenibilidad a las acciones"},{"$f":"+SUM(C54:C58)","v":0},{"$f":"+SUM(D54:D58)","v":0},{"$f":"+SUM(E54:E58)","v":0},{"$f":"+SUM(F54:F58)","v":0},{"$f":"+SUM(G54:G58)","v":0},0]
[null,{"$f":"+Evaluacion!J60","v":"Total PAIs"},{"$f":"+C59+C52+C38+C22+C17","v":0},0,0,0,0,0]
[]
[]
[]
[]
[null,"INVERSIONES DE LAS CONTRAPARTE DEL OO"]
[null,{"$f":"+B7","v":"Inversiones PAI  (Millones de pesos)"},{"$f":"+C7","v":1},{"$f":"+C66+1","v":2},{"$f":"+D66+1","v":3},{"$f":"+E66+1","v":4},{"$f":"+F66+1","v":5},"TOTAL"]
[null,{"$f":"+B8","v":"1. PAI para reducir gastos de energía eléctrica"}]
[null,{"$f":"+B9","v":"Solicitud de cambio de tarifa eléctrica para reducir gasto por concepto de energía eléctrica."},{"$f":"+C9*(1-'Datos basicos'!$B$37)","v":0},{"$f":"+D9*(1-'Datos basicos'!$C$37)","v":0},{"$f":"+E9*(1-'Datos basicos'!$D$37)","v":0},{"$f":"+F9*(1-'Datos basicos'!$E$37)","v":0},{"$f":"+G9*(1-'Datos basicos'!$F$37)","v":0},{"$f":"SUM(C68:G68)","v":0}]
[null,{"$f":"+B10","v":"Reducción de la potencia reactiva (reducción del factor de potencia)"},{"$f":"+C10*(1-'Datos basicos'!$B$34)","v":0},{"$f":"+D10*(1-'Datos basicos'!$C$34)","v":0},{"$f":"+E10*(1-'Datos basicos'!$D$34)","v":0},{"$f":"+F10*(1-'Datos basicos'!$E$34)","v":0},{"$f":"+G10*(1-'Datos basicos'!$F$34)","v":0},0]
[null,"Sustitución de equipos de bombeo de agua potable para reducir consumo de energía",{"$f":"+C11*(1-'Datos basicos'!$B$32)","v":0},{"$f":"+D11*(1-'Datos basicos'!$C$32)","v":0},{"$f":"+E11*(1-'Datos basicos'!$D$32)","v":0},{"$f":"+F11*(1-'Datos basicos'!$E$32)","v":0},{"$f":"+G11*(1-'Datos basicos'!$F$32)","v":0},0]
[null,"Sustitución o construcción de tanques de almacenamiento de agua para modificar políticas de operación del equipo de bombeo",{"$f":"+C12*(1-'Datos basicos'!$B$32)","v":0},{"$f":"+D12*(1-'Datos basicos'!$C$32)","v":0},{"$f":"+E12*(1-'Datos basicos'!$D$32)","v":0},{"$f":"+F12*(1-'Datos basicos'!$E$32)","v":0},{"$f":"+G12*(1-'Datos basicos'!$F$32)","v":0},0]
[null,"Automatización de equipos de bombeo para modificar políticas de operación",{"$f":"+C13*(1-'Datos basicos'!$B$32)","v":0},{"$f":"+D13*(1-'Datos basicos'!$C$32)","v":0},{"$f":"+E13*(1-'Datos basicos'!$D$32)","v":0},{"$f":"+F13*(1-'Datos basicos'!$E$32)","v":0},{"$f":"+G13*(1-'Datos basicos'!$F$32)","v":0},0]
[null,"Sustitución de bombas de alcantarillado",{"$f":"+C14*(1-'Datos basicos'!$B$33)","v":0},{"$f":"+D14*(1-'Datos basicos'!$C$33)","v":0},{"$f":"+E14*(1-'Datos basicos'!$D$33)","v":0},{"$f":"+F14*(1-'Datos basicos'!$E$33)","v":0},{"$f":"+G14*(1-'Datos basicos'!$F$33)","v":0},0]
[null,"Reducción de gastos de energía en plantas de tratamiento de aguas residuales (PTAR)",{"$f":"+C15*(1-'Datos basicos'!$B$33)","v":0},{"$f":"+D15*(1-'Datos basicos'!$C$33)","v":0},{"$f":"+E15*(1-'Datos basicos'!$D$33)","v":0},{"$f":"+F15*(1-'Datos basicos'!$E$33)","v":0},{"$f":"+G15*(1-'Datos basicos'!$F$33)","v":0},0]
[null,"Elaboración de una auditoría energética",{"$f":"+C16*(1-'Datos basicos'!$B$37)","v":0},{"$f":"+D16*(1-'Datos basicos'!$C$37)","v":0},{"$f":"+E16*(1-'Datos basicos'!$D$37)","v":0},{"$f":"+F16*(1-'Datos basicos'!$E$37)","v":0},{"$f":"+G16*(1-'Datos basicos'!$F$37)","v":0},0]
[null,"Total Inversión PAI para reducción de gastos de energía eléctrica",{"$f":"+SUM(C68:C75)","v":0},{"$f":"+SUM(D68:D75)","v":0},{"$f":"+SUM(E68:E75)","v":0},{"$f":"+SUM(F68:F75)","v":0},{"$f":"+SUM(G68:G75)","v":0},0]
[null,"2. PAI para incrementar la productividad del personal "]
[null,"Programa de capacitación y profesionalización para incrementar la productividad del personal.",{"$f":"+C19*(1-'Datos basicos'!$B$37)","v":0},{"$f":"+D19*(1-'Datos basicos'!$C$37)","v":0},{"$f":"+E19*(1-'Datos basicos'!$D$37)","v":0},{"$f":"+F19*(1-'Datos basicos'!$E$37)","v":0},{"$f":"+G19*(1-'Datos basicos'!$F$37)","v":0},{"$f":"SUM(C78:G78)","v":0}]
[null,"Revisión del manual de funciones y cargos del personal del OO",{"$f":"+C20*0.3","v":0},{"$f":"+D20*0.3","v":0},{"$f":"+E20*0.3","v":0},{"$f":"+F20*0.3","v":0},{"$f":"+G20*0.3","v":0},0]
[null,"Establecimiento de un programa de retiro voluntario y obligado",{"$f":"+C21","v":0},{"$f":"+D21","v":0},{"$f":"+E21","v":0},{"$f":"+F21","v":0},{"$f":"+G21","v":0},0]
[null,"Total Inversión PAI para incrementar la productividad del personal",{"$f":"+SUM(C78:C80)","v":0},{"$f":"+SUM(D78:D80)","v":0},{"$f":"+SUM(E78:E80)","v":0},{"$f":"+SUM(F78:F80)","v":0},{"$f":"+SUM(G78:G80)","v":0},0]
[null,"3. PAI para mejora de la Gestión Comercial"]
[null,"Ajuste de consumos de cuota fija",{"$f":"+C24*(1-'Datos basicos'!$B$37)","v":0},{"$f":"+D24*(1-'Datos basicos'!$C$37)","v":0},{"$f":"+E24*(1-'Datos basicos'!$D$37)","v":0},{"$f":"+F24*(1-'Datos basicos'!$E$37)","v":0},{"$f":"+G24*(1-'Datos basicos'!$F$37)","v":0},0]
[null,"Corrección de errores de micromedición mediante sustitución de medidores.",{"$f":"+C25*(1-'Datos basicos'!$B$35)","v":0},{"$f":"+D25*(1-'Datos basicos'!$C$35)","v":0},{"$f":"+E25*(1-'Datos basicos'!$D$35)","v":0},{"$f":"+F25*(1-'Datos basicos'!$E$35)","v":0},{"$f":"+G25*(1-'Datos basicos'!$F$35)","v":0},0]
[null,"Impartición de cursos de formación de recursos humanos en eficiencia comercial",{"$f":"+C26*(1-'Datos basicos'!$B$35)","v":0},{"$f":"+D26*(1-'Datos basicos'!$C$35)","v":0},{"$f":"+E26*(1-'Datos basicos'!$D$35)","v":0},{"$f":"+F26*(1-'Datos basicos'!$E$35)","v":0},{"$f":"+G26*(1-'Datos basicos'!$F$35)","v":0},0]
[null,"Impartición de cursos de formación de recursos humanos en atención a usuarios",{"$f":"+C27*(1-'Datos basicos'!$B$35)","v":0},{"$f":"+D27*(1-'Datos basicos'!$C$35)","v":0},{"$f":"+E27*(1-'Datos basicos'!$D$35)","v":0},{"$f":"+F27*(1-'Datos basicos'!$E$35)","v":0},{"$f":"+G27*(1-'Datos basicos'!$F$35)","v":0},0]
[null,"Firma de convenios con bancos y otras instituciones para ampliar las opciones de pago de los servicios de agua y saneamiento",{"$f":"+C28*(1-'Datos basicos'!$B$35)","v":0},{"$f":"+D28*(1-'Datos basicos'!$C$35)","v":0},{"$f":"+E28*(1-'Datos basicos'!$D$35)","v":0},{"$f":"+F28*(1-'Datos basicos'!$E$35)","v":0},{"$f":"+G28*(1-'Datos basicos'!$F$35)","v":0},0]
[null,"Mejoras a la facturación mediante un nuevo sistema comercial",{"$f":"+C29*(1-'Datos basicos'!$B$35)","v":0},{"$f":"+D29*(1-'Datos basicos'!$C$35)","v":0},{"$f":"+E29*(1-'Datos basicos'!$D$35)","v":0},{"$f":"+F29*(1-'Datos basicos'!$E$35)","v":0},{"$f":"+G29*(1-'Datos basicos'!$F$35)","v":0},0]
[null,"Mejoras en la cobranza mediante esquemas que faciliten el pago.",{"$f":"+C30*(1-'Datos basicos'!$B$35)","v":0},{"$f":"+D30*(1-'Datos basicos'!$C$35)","v":0},{"$f":"+E30*(1-'Datos basicos'!$D$35)","v":0},{"$f":"+F30*(1-'Datos basicos'!$E$35)","v":0},{"$f":"+G30*(1-'Datos basicos'!$F$35)","v":0},0]
[null,"Localización y regularización de tomas clandestinas",{"$f":"+C31*(1-'Datos basicos'!$B$35)","v":0},{"$f":"+D31*(1-'Datos basicos'!$C$35)","v":0},{"$f":"+E31*(1-'Datos basicos'!$D$35)","v":0},{"$f":"+F31*(1-'Datos basicos'!$E$35)","v":0},{"$f":"+G31*(1-'Datos basicos'!$F$35)","v":0},0]
[null,"Censo de usuarios para mejorar el padrón. Establecimiento de esquemas de actualización continua del padrón.",{"$f":"+C32*(1-'Datos basicos'!$B$35)","v":0},{"$f":"+D32*(1-'Datos basicos'!$C$35)","v":0},{"$f":"+E32*(1-'Datos basicos'!$D$35)","v":0},{"$f":"+F32*(1-'Datos basicos'!$E$35)","v":0},{"$f":"+G32*(1-'Datos basicos'!$F$35)","v":0},0]
[null,"Sistema de cómputo para altas y bajas del padrón de usuarios.",{"$f":"+C33*(1-'Datos basicos'!$B$35)","v":0},{"$f":"+D33*(1-'Datos basicos'!$C$35)","v":0},{"$f":"+E33*(1-'Datos basicos'!$D$35)","v":0},{"$f":"+F33*(1-'Datos basicos'!$E$35)","v":0},{"$f":"+G33*(1-'Datos basicos'!$F$35)","v":0},0]
[null,"Estudio tarifario con el fin de realizar la actualización de las tarifas de agua",{"$f":"+C34*(1-'Datos basicos'!$B$37)","v":0},{"$f":"+D34*(1-'Datos basicos'!$C$37)","v":0},{"$f":"+E34*(1-'Datos basicos'!$D$37)","v":0},{"$f":"+F34*(1-'Datos basicos'!$E$37)","v":0},{"$f":"+G34*(1-'Datos basicos'!$F$37)","v":0},{"$f":"SUM(C93:G93)","v":0}]
[null,"Modificaciones a la estructura tarifaria",{"$f":"+C35*(1-'Datos basicos'!$B$37)","v":0},{"$f":"+D35*(1-'Datos basicos'!$C$37)","v":0},{"$f":"+E35*(1-'Datos basicos'!$D$37)","v":0},{"$f":"+F35*(1-'Datos basicos'!$E$37)","v":0},{"$f":"+G35*(1-'Datos basicos'!$F$37)","v":0},0]
[null,"Reformas para lograr que las tarifas se actualicen de manera continua",{"$f":"+C36*(1-'Datos basicos'!$B$37)","v":0},{"$f":"+D36*(1-'Datos basicos'!$C$37)","v":0},{"$f":"+E36*(1-'Datos basicos'!$D$37)","v":0},{"$f":"+F36*(1-'Datos basicos'!$E$37)","v":0},{"$f":"+G36*(1-'Datos basicos'!$F$37)","v":0},0]
[null,"Reformas al marco legal para que el OO pueda establecer tarifas adecuadas",{"$f":"+C37*(1-'Datos basicos'!$B$37)","v":0},{"$f":"+D37*(1-'Datos basicos'!$C$37)","v":0},{"$f":"+E37*(1-'Datos basicos'!$D$37)","v":0},{"$f":"+F37*(1-'Datos basicos'!$E$37)","v":0},{"$f":"+G37*(1-'Datos basicos'!$F$37)","v":0},0]
[null,"Total PAI para mejora de la Gestión Comercial",{"$f":"+SUM(C83:C96)","v":0},{"$f":"+SUM(D83:D96)","v":0},{"$f":"+SUM(E83:E96)","v":0},{"$f":"+SUM(F83:F96)","v":0},{"$f":"+SUM(G83:G96)","v":0},0]
[null,"4. PAI para reducción de Pérdidas Físicas de Agua"]
[null,"Localización y reparación de fugas en tanques",{"$f":"+C40*(1-'Datos basicos'!$B$34)","v":0},{"$f":"+D40*(1-'Datos basicos'!$C$34)","v":0},{"$f":"+E40*(1-'Datos basicos'!$D$34)","v":0},{"$f":"+F40*(1-'Datos basicos'!$E$34)","v":0},{"$f":"+G40*(1-'Datos basicos'!$F$34)","v":0},{"$f":"SUM(C99:G99)","v":0}]
[null,"Localización y reparación de fugas en tuberías principales y secundarias",{"$f":"+C41*(1-'Datos basicos'!$B$34)","v":0},{"$f":"+D41*(1-'Datos basicos'!$C$34)","v":0},{"$f":"+E41*(1-'Datos basicos'!$D$34)","v":0},{"$f":"+F41*(1-'Datos basicos'!$E$34)","v":0},{"$f":"+G41*(1-'Datos basicos'!$F$34)","v":0},0]
[null,"Instalación de micromedidores en las tomas",{"$f":"+C42*(1-'Datos basicos'!$B$34)","v":0},{"$f":"+D42*(1-'Datos basicos'!$C$34)","v":0},{"$f":"+E42*(1-'Datos basicos'!$D$34)","v":0},{"$f":"+F42*(1-'Datos basicos'!$E$34)","v":0},{"$f":"+G42*(1-'Datos basicos'!$F$34)","v":0},0]
[null,"Sistematización de lectura de micromedidores en tomas e incorporación de lecturas al sistema de facturación y cobranza",{"$f":"+C43*(1-'Datos basicos'!$B$34)","v":0},{"$f":"+D43*(1-'Datos basicos'!$C$34)","v":0},{"$f":"+E43*(1-'Datos basicos'!$D$34)","v":0},{"$f":"+F43*(1-'Datos basicos'!$E$34)","v":0},{"$f":"+G43*(1-'Datos basicos'!$F$34)","v":0},0]
[null,"Optimización hidráulica: sectorización de la red de distribución, control de presión, optimización de la capacidad de almacenamiento.",{"$f":"+C44*(1-'Datos basicos'!$B$34)","v":0},{"$f":"+D44*(1-'Datos basicos'!$C$34)","v":0},{"$f":"+E44*(1-'Datos basicos'!$D$34)","v":0},{"$f":"+F44*(1-'Datos basicos'!$E$34)","v":0},{"$f":"+G44*(1-'Datos basicos'!$F$34)","v":0},0]
[null,"Catastro de infraestructura hidráulica y de redes",{"$f":"+C45*(1-'Datos basicos'!$B$34)","v":0},{"$f":"+D45*(1-'Datos basicos'!$C$34)","v":0},{"$f":"+E45*(1-'Datos basicos'!$D$34)","v":0},{"$f":"+F45*(1-'Datos basicos'!$E$34)","v":0},{"$f":"+G45*(1-'Datos basicos'!$F$34)","v":0},0]
[null,"Instalación de macromedidores en captaciones",{"$f":"+C46*(1-'Datos basicos'!$B$34)","v":0},{"$f":"+D46*(1-'Datos basicos'!$C$34)","v":0},{"$f":"+E46*(1-'Datos basicos'!$D$34)","v":0},{"$f":"+F46*(1-'Datos basicos'!$E$34)","v":0},{"$f":"+G46*(1-'Datos basicos'!$F$34)","v":0},0]
[null,"Instalación de macromedidores en sectores",{"$f":"+C47*(1-'Datos basicos'!$B$34)","v":0},{"$f":"+D47*(1-'Datos basicos'!$C$34)","v":0},{"$f":"+E47*(1-'Datos basicos'!$D$34)","v":0},{"$f":"+F47*(1-'Datos basicos'!$E$34)","v":0},{"$f":"+G47*(1-'Datos basicos'!$F$34)","v":0},0]
[null,"Sistematización de lectura de macromedidores en captaciones y sectores ( p.ej. a través de telemetría)",{"$f":"+C48*(1-'Datos basicos'!$B$34)","v":0},{"$f":"+D48*(1-'Datos basicos'!$C$34)","v":0},{"$f":"+E48*(1-'Datos basicos'!$D$34)","v":0},{"$f":"+F48*(1-'Datos basicos'!$E$34)","v":0},{"$f":"+G48*(1-'Datos basicos'!$F$34)","v":0},0]
[null,"Sustitución de tuberías con alto índice de fugas",{"$f":"+C49*(1-'Datos basicos'!$B$34)","v":0},{"$f":"+D49*(1-'Datos basicos'!$C$34)","v":0},{"$f":"+E49*(1-'Datos basicos'!$D$34)","v":0},{"$f":"+F49*(1-'Datos basicos'!$E$34)","v":0},{"$f":"+G49*(1-'Datos basicos'!$F$34)","v":0},0]
[null,"Capacitación del personal del OO en operación de equipos",{"$f":"+C50*(1-'Datos basicos'!$B$37)","v":0},{"$f":"+D50*(1-'Datos basicos'!$C$37)","v":0},{"$f":"+E50*(1-'Datos basicos'!$D$37)","v":0},{"$f":"+F50*(1-'Datos basicos'!$E$37)","v":0},{"$f":"+G50*(1-'Datos basicos'!$F$37)","v":0},0]
[null,"Sistema de Información Geográfica",{"$f":"+C51*(1-'Datos basicos'!$B$37)","v":0},{"$f":"+D51*(1-'Datos basicos'!$C$37)","v":0},{"$f":"+E51*(1-'Datos basicos'!$D$37)","v":0},{"$f":"+F51*(1-'Datos basicos'!$E$37)","v":0},{"$f":"+G51*(1-'Datos basicos'!$F$37)","v":0},0]
[null,"Total PAI de reducciòn de Pérdidas Físicas de Agua",{"$f":"+SUM(C99:C110)","v":0},{"$f":"+SUM(D99:D110)","v":0},{"$f":"+SUM(E99:E110)","v":0},{"$f":"+SUM(F99:F110)","v":0},{"$f":"+SUM(G99:G110)","v":0},0]
[null,"5. PAI para sostenibilidad a las acciones "]
[null,"Establecimiento de un comité ciudadano del organismo operador",{"$f":"+C54*(1-'Datos basicos'!$B$37)","v":0},{"$f":"+D54*(1-'Datos basicos'!$C$37)","v":0},{"$f":"+E54*(1-'Datos basicos'!$D$37)","v":0},{"$f":"+F54*(1-'Datos basicos'!$E$37)","v":0},{"$f":"+G54*(1-'Datos basicos'!$F$37)","v":0},{"$f":"SUM(C113:G113)","v":0}]
[null,"Elaboración de un código de ética y suscripción por parte del personal del OO",{"$f":"+C55*(1-'Datos basicos'!$B$37)","v":0},{"$f":"+D55*(1-'Datos basicos'!$C$37)","v":0},{"$f":"+E55*(1-'Datos basicos'!$D$37)","v":0},{"$f":"+F55*(1-'Datos basicos'!$E$37)","v":0},{"$f":"+G55*(1-'Datos basicos'!$F$37)","v":0},0]
[null,"Sistema informático de contabilidad",{"$f":"+C56*(1-'Datos basicos'!$B$37)","v":0},{"$f":"+D56*(1-'Datos basicos'!$C$37)","v":0},{"$f":"+E56*(1-'Datos basicos'!$D$37)","v":0},{"$f":"+F56*(1-'Datos basicos'!$E$37)","v":0},{"$f":"+G56*(1-'Datos basicos'!$F$37)","v":0},0]
[null,"Sistema de planeación Integral",{"$f":"+C57*(1-'Datos basicos'!$B$37)","v":0},{"$f":"+D57*(1-'Datos basicos'!$C$37)","v":0},{"$f":"+E57*(1-'Datos basicos'!$D$37)","v":0},{"$f":"+F57*(1-'Datos basicos'!$E$37)","v":0},{"$f":"+G57*(1-'Datos basicos'!$F$37)","v":0},0]
[null,"Asesoría para financiamiento de contraparte",{"$f":"+C58*(1-'Datos basicos'!$B$37)","v":0},{"$f":"+D58*(1-'Datos basicos'!$C$37)","v":0},{"$f":"+E58*(1-'Datos basicos'!$D$37)","v":0},{"$f":"+F58*(1-'Datos basicos'!$E$37)","v":0},{"$f":"+G58*(1-'Datos basicos'!$F$37)","v":0},0]
[null,"Total PAI para sostenibilidad a las acciones",{"$f":"+SUM(C113:C117)","v":0},{"$f":"+SUM(D113:D117)","v":0},{"$f":"+SUM(E113:E117)","v":0},{"$f":"+SUM(F113:F117)","v":0},{"$f":"+SUM(G113:G117)","v":0},0]
[null,"Total PAIs",{"$f":"+C118+C111+C97+C81+C76","v":0},{"$f":"+D118+D111+D97+D81+D76","v":0},0,0,0,0]
[]
[null,"Total a Semblanza F",{"$f":"+(C76+C81+C97+C111+SUM(C113:C116))*1000000","v":0},0,0,0,0,0]

{"sheet":"Parametros Evaluacion","index":33,"n_rows":92,"n_cols":8,"rows_kept":92,"cut":false,"hidden":true,"merged":[[6,6,6,7],[6,2,6,4],[3,2,3,9],[4,2,4,9]]}
[]
[null,"Formato Evaluación 9. PARAMETROS"]
[]
[null,"NOMBRE:",{"$f":"+'Acciones a Ejecutar'!B4","v":"X"}]
[null,"AÑO:",{"$f":"+'Acciones a Ejecutar'!B5","v":0}]
[]
[null,null,"Definidos",null,null,null,"Sugeridos"]
[null,"Variable","Menor","Mayor","Vida Util",null,"Menor","Mayor"]
[null,"Total Energía Eléctrica",{"$f":"+IF(COUNTIF('Acciones a Ejecutar'!B8:B14,\"si\")>0,G9,0)","v":0},{"$f":"+IF(COUNTIF('Acciones a Ejecutar'!B8:B14,\"si\")>0,H9,0)","v":0},null,null,0,0.05]
[null,"Aumento de ventas por tanques (m3/toma)",{"$f":"+IF('Acciones a Ejecutar'!$B11=\"si\",G10,0)","v":0},{"$f":"+IF('Acciones a Ejecutar'!$B11=\"si\",H10,0)","v":0},null,null,0,0.01]
[null,"Disminución de costo de personal por automatización de bombas (%)",{"$f":"+IF('Acciones a Ejecutar'!$B12=\"si\",G11,0)","v":0},{"$f":"+IF('Acciones a Ejecutar'!$B12=\"si\",H11,0)","v":0},null,null,0,0.01]
[null,"Empleados por 1,000 tomas (meta)",{"$f":"MIN(MAX(D12*0.4,2),D12)","v":0},{"$f":"+'Datos basicos'!B26","v":0},null,null,{"$f":"MIN(MAX(D12*0.4,2),D12)","v":0},{"$f":"+'Datos basicos'!B26","v":0}]
[null,"Reducción de personal por capacitación",{"$f":"+IF('Acciones a Ejecutar'!$B18=\"si\",G13,0)","v":0},{"$f":"+IF('Acciones a Ejecutar'!$B18=\"si\",H13,0)","v":0},null,null,0,{"$f":"MAX(0,(H12-G12)*0.05)","v":0}]
[null,"Reducción de personal por manuales",{"$f":"+IF('Acciones a Ejecutar'!$B19=\"si\",G14,0)","v":0},{"$f":"+IF('Acciones a Ejecutar'!$B19=\"si\",H14,0)","v":0},null,null,0,{"$f":"MAX(0,(H12-G12)*0.1)","v":0}]
[null,"Reducción de personal por retiro",{"$f":"+IF('Acciones a Ejecutar'!$B20=\"si\",G15,0)","v":0},{"$f":"+IF('Acciones a Ejecutar'!$B20=\"si\",H15,0)","v":0},null,null,0,{"$f":"MAX(H12-G12-H13-H14,0)","v":0}]
[null,"Meta Eficiencia Comercial",0,{"$f":"MAX(IF(Practicas!$C$18=\"SI\",95%,85%),'Proyecciones Base'!C17)","v":0.85},null,null,0,{"$f":"MAX(IF(Practicas!$C$18=\"SI\",95%,85%),'Proyecciones Base'!G17)","v":0.85}]
[null,"Incremento Tarifa Cuota Fija",{"$f":"+IF('Acciones a Ejecutar'!$B23=\"si\",G17,0)","v":0},{"$f":"+IF('Acciones a Ejecutar'!$B23=\"si\",H17,0)","v":0},null,null,0,1]
[null,"Incremento de facturación por cambio de medidores",{"$f":"+IF('Acciones a Ejecutar'!$B24=\"si\",G18,0)","v":0},{"$f":"+IF('Acciones a Ejecutar'!$B24=\"si\",H18,0)","v":0},null,null,0,0.2]
[null,"Mejora de eficiencia comercial por capacitación",{"$f":"+IF('Acciones a Ejecutar'!$B25=\"si\",G19,0)","v":0},{"$f":"+IF('Acciones a Ejecutar'!$B25=\"si\",H19,0)","v":0},null,null,0,0.02]
[null,"Mejora de eficiencia comercial por red de cobro",{"$f":"+IF('Acciones a Ejecutar'!$B27=\"si\",G20,0)","v":0},{"$f":"+IF('Acciones a Ejecutar'!$B27=\"si\",H20,0)","v":0},null,null,0,0.02]
[null,"Mejora de eficiencia comercial por nuevo sistema",{"$f":"+IF('Acciones a Ejecutar'!$B28=\"si\",G21,0)","v":0},{"$f":"+IF('Acciones a Ejecutar'!$B28=\"si\",H21,0)","v":0},null,null,0,0.05]
[null,"Mejora de eficiencia comercial por facilidad de pago",{"$f":"+IF('Acciones a Ejecutar'!$B29=\"si\",G22,0)","v":0},{"$f":"+IF('Acciones a Ejecutar'!$B29=\"si\",H22,0)","v":0},null,null,0,0.02]
[null,"Aumento de facturación por clandestinos",{"$f":"+IF('Acciones a Ejecutar'!$B30=\"si\",G23,0)","v":0},{"$f":"+IF('Acciones a Ejecutar'!$B30=\"si\",H23,0)","v":0},null,null,0,0.05]
[null,"Aumento de usuarios por censo",{"$f":"+IF('Acciones a Ejecutar'!$B31=\"si\",G24,0)","v":0},{"$f":"+IF('Acciones a Ejecutar'!$B31=\"si\",H24,0)","v":0},null,null,0,7.0000000000000007E-2]
[null,"Aumento de usuarios por sistema",{"$f":"+IF('Acciones a Ejecutar'!$B32=\"si\",G25,0)","v":0},{"$f":"+IF('Acciones a Ejecutar'!$B32=\"si\",H25,0)","v":0},null,null,0,0.01]
[null,"Aumento de facturación por cambio de uso",{"$f":"+IF('Acciones a Ejecutar'!$B31=\"si\",G26,0)","v":0},{"$f":"+IF('Acciones a Ejecutar'!$B31=\"si\",H26,0)","v":0},null,null,0,0.03]
[null,"Aumento de tarifas medias por nuevas tarifas",{"$f":"+IF('Acciones a Ejecutar'!$B33=\"si\",G27,0)","v":0},{"$f":"+IF('Acciones a Ejecutar'!$B33=\"si\",H27,0)","v":0},null,null,0,0.3]
[null,"Aumento de tarifas medias por estructura de tarifas",{"$f":"+IF('Acciones a Ejecutar'!$B34=\"si\",G28,0)","v":0},{"$f":"+IF('Acciones a Ejecutar'!$B34=\"si\",H28,0)","v":0},null,null,0,0.1]
[null,"Mejora E.F. por tanques",{"$f":"+IF('Acciones a Ejecutar'!$B39=\"si\",G29,0)","v":0},{"$f":"+IF('Acciones a Ejecutar'!$B39=\"si\",H29,0)","v":0},null,null,0,{"$f":"MAX(0,(MIN('Proyecciones Base'!$C$28*1.5,0.75)-'Proyecciones Base'!$C$28)*0.03)","v":0}]
[null,"Mejora E.F. en tuberías",{"$f":"+IF('Acciones a Ejecutar'!$B40=\"si\",G30,0)","v":0},{"$f":"+IF('Acciones a Ejecutar'!$B40=\"si\",H30,0)","v":0},null,null,0,{"$f":"MAX(0,(MIN('Proyecciones Base'!$C$28*1.5,0.75)-'Proyecciones Base'!$C$28)*0.15,0)","v":0}]
[null,"Mejora E.F. en tomas",{"$f":"+IF('Acciones a Ejecutar'!$B41=\"si\",G31,0)","v":0},{"$f":"+IF('Acciones a Ejecutar'!$B41=\"si\",H31,0)","v":0},null,null,0,{"$f":"MAX(0,(MIN('Proyecciones Base'!$C$28*1.5,0.75)-'Proyecciones Base'!$C$28)*0.5)","v":0}]
[null,"Aumento de ingresos por tomas de lectura",{"$f":"+IF('Acciones a Ejecutar'!$B42=\"si\",G32,0)","v":0},{"$f":"+IF('Acciones a Ejecutar'!$B42=\"si\",H32,0)","v":0},null,null,0,0.05]
[null,"Mejora E.F. por sectorización",{"$f":"+IF('Acciones a Ejecutar'!$B43=\"si\",G33,0)","v":0},{"$f":"+IF('Acciones a Ejecutar'!$B43=\"si\",H33,0)","v":0},null,null,0,{"$f":"MAX(0,(MIN('Proyecciones Base'!$C$28*1.5,0.75)-'Proyecciones Base'!$C$28)*0.05,0)","v":0}]
[null,"Mejora E.F. por catastro de redes",{"$f":"+IF('Acciones a Ejecutar'!$B44=\"si\",G34,0)","v":0},{"$f":"+IF('Acciones a Ejecutar'!$B44=\"si\",H34,0)","v":0},null,null,0,{"$f":"MAX(0,(MIN('Proyecciones Base'!$C$28*1.5,0.75)-'Proyecciones Base'!$C$28)*0.01,0)","v":0}]
[null,"Mejora E.F. por macromedición en captaciones",{"$f":"+IF('Acciones a Ejecutar'!$B45=\"si\",G35,0)","v":0},{"$f":"+IF('Acciones a Ejecutar'!$B45=\"si\",H35,0)","v":0},null,null,0,{"$f":"MAX(0,(MIN('Proyecciones Base'!$C$28*1.5,0.75)-'Proyecciones Base'!$C$28)*0.03,0)","v":0}]
[null,"Mejora E.F. por macromedición en sectores",{"$f":"+IF('Acciones a Ejecutar'!$B46=\"si\",G36,0)","v":0},{"$f":"+IF('Acciones a Ejecutar'!$B46=\"si\",H36,0)","v":0},null,null,0,{"$f":"MAX(0,(MIN('Proyecciones Base'!$C$28*1.5,0.75)-'Proyecciones Base'!$C$28)*0.01)","v":0}]
[null,"Mejora E.F. por lectura de macros",{"$f":"+IF('Acciones a Ejecutar'!$B47=\"si\",G37,0)","v":0},{"$f":"+IF('Acciones a Ejecutar'!$B47=\"si\",H37,0)","v":0},null,null,0,{"$f":"MAX(0,(MIN('Proyecciones Base'!$C$28*1.5,0.75)-'Proyecciones Base'!$C$28)*0.01)","v":0}]
[null,"Mejora E.F. por sustitución de tuberías",{"$f":"+IF('Acciones a Ejecutar'!$B48=\"si\",G38,0)","v":0},{"$f":"+IF('Acciones a Ejecutar'!$B48=\"si\",H38,0)","v":0},null,null,0,{"$f":"MAX(0,(MIN('Proyecciones Base'!$C$28*1.5,0.75)-'Proyecciones Base'!$C$28)*0.15,0)","v":0}]
[null,"Mejora E.F. por mayor capacitación",{"$f":"+IF('Acciones a Ejecutar'!$B49=\"si\",G39,0)","v":0},{"$f":"+IF('Acciones a Ejecutar'!$B49=\"si\",H39,0)","v":0},null,null,0,{"$f":"MAX(0,(MIN('Proyecciones Base'!$C$28*1.5,0.75)-'Proyecciones Base'!$C$28)*0.03,0)","v":0}]
[null,"Mejora E.F. por GIS",{"$f":"+IF('Acciones a Ejecutar'!$B50=\"si\",G40,0)","v":0},{"$f":"+IF('Acciones a Ejecutar'!$B50=\"si\",H40,0)","v":0},null,null,0,{"$f":"MAX(0,(MIN('Proyecciones Base'!$C$28*1.3,0.75)-'Proyecciones Base'!$C$28)*0.02,0)","v":0}]
[]
[null,{"$f":"+'Premisas Inversiones'!B8","v":"Asesoría Cambio de tarifas Eléctrica"},{"$f":"+IF('Acciones a Ejecutar'!$B8=\"si\",VLOOKUP('Datos basicos'!$B$29,Precios!$C$10:$E$13,2),0)","v":0},{"$f":"+IF('Acciones a Ejecutar'!$B8=\"si\",VLOOKUP('Datos basicos'!$B$29,Precios!$C$10:$E$13,3),0)","v":0},99,null,{"$f":"+Precios!D10","v":100000},{"$f":"+Precios!E13","v":13500000}]
[null,{"$f":"+'Premisas Inversiones'!B9","v":"Instalación o sustitución de equipos"},{"$f":"+IF('Acciones a Ejecutar'!$B9=\"si\",VLOOKUP('Datos basicos'!$B$29,Precios!$C$15:$E$18,2),0)","v":0},{"$f":"+IF('Acciones a Ejecutar'!$B9=\"si\",VLOOKUP('Datos basicos'!$B$29,Precios!$C$15:$E$18,3),0)","v":0},10,null,{"$f":"+Precios!D15","v":150000},{"$f":"+Precios!E18","v":4500000}]
[null,{"$f":"+'Premisas Inversiones'!B10","v":"Compra e instalación de bombas AP"},{"$f":"+IF('Acciones a Ejecutar'!$B10=\"si\",VLOOKUP('Datos basicos'!$B$29,Precios!$C$20:$E$23,2),0)","v":0},{"$f":"+IF('Acciones a Ejecutar'!$B10=\"si\",VLOOKUP('Datos basicos'!$B$29,Precios!$C$20:$E$23,3),0)","v":0},10,null,{"$f":"+Precios!D20","v":500000},{"$f":"+Precios!E23","v":27000000}]
[null,{"$f":"+'Premisas Inversiones'!B11","v":"Construcción de tanques"},{"$f":"+IF('Acciones a Ejecutar'!$B11=\"si\",VLOOKUP('Datos basicos'!$B$29,Precios!$C$25:$E$28,2),0)","v":0},{"$f":"+IF('Acciones a Ejecutar'!$B11=\"si\",VLOOKUP('Datos basicos'!$B$29,Precios!$C$25:$E$28,3),0)","v":0},30,null,{"$f":"+Precios!D25","v":2000000},{"$f":"+Precios!E28","v":90000000}]
[null,{"$f":"+'Premisas Inversiones'!B12","v":"Automatización Bombas"},{"$f":"+IF('Acciones a Ejecutar'!$B12=\"si\",VLOOKUP('Datos basicos'!$B$29,Precios!$C$30:$E$33,2),0)","v":0},{"$f":"+IF('Acciones a Ejecutar'!$B12=\"si\",VLOOKUP('Datos basicos'!$B$29,Precios!$C$30:$E$33,3),0)","v":0},10,null,{"$f":"+Precios!D30","v":200000},{"$f":"+Precios!E33","v":9000000}]
[null,{"$f":"+'Premisas Inversiones'!B13","v":"Compra e instalación de bombas A.R."},{"$f":"+IF('Acciones a Ejecutar'!$B13=\"si\",VLOOKUP('Datos basicos'!$B$29,Precios!$C$35:$E$38,2),0)","v":0},{"$f":"+IF('Acciones a Ejecutar'!$B13=\"si\",VLOOKUP('Datos basicos'!$B$29,Precios!$C$35:$E$38,3),0)","v":0},8,null,{"$f":"+Precios!D35","v":500000},{"$f":"+Precios!E38","v":20250000}]
[null,{"$f":"+'Premisas Inversiones'!B14","v":"Cambio de equipos PTAR"},{"$f":"+IF('Acciones a Ejecutar'!$B14=\"si\",VLOOKUP('Datos basicos'!$B$29,Precios!$C$40:$E$43,2),0)","v":0},{"$f":"+IF('Acciones a Ejecutar'!$B14=\"si\",VLOOKUP('Datos basicos'!$B$29,Precios!$C$40:$E$43,3),0)","v":0},10,null,{"$f":"+Precios!D40","v":100000},{"$f":"+Precios!E43","v":20250000}]
[null,{"$f":"+'Premisas Inversiones'!B15","v":"Estudio Eficiencia Energética"},{"$f":"+IF('Acciones a Ejecutar'!$B15=\"si\",VLOOKUP('Datos basicos'!$B$29,Precios!$C$45:$E$48,2),0)","v":0},{"$f":"+IF('Acciones a Ejecutar'!$B15=\"si\",VLOOKUP('Datos basicos'!$B$29,Precios!$C$45:$E$48,3),0)","v":0},99,null,{"$f":"+Precios!D45","v":100000},{"$f":"+Precios!E48","v":4000000}]
[null,"Cursos de Capacitación",{"$f":"+IF('Acciones a Ejecutar'!$B18=\"si\",VLOOKUP('Datos basicos'!$B$29,Precios!$C$50:$E$53,2),0)","v":0},{"$f":"+IF('Acciones a Ejecutar'!$B18=\"si\",VLOOKUP('Datos basicos'!$B$29,Precios!$C$50:$E$53,3),0)","v":0},99,null,{"$f":"+Precios!D50","v":50000},{"$f":"+Precios!E53","v":1350000}]
[null,"Costo Manuales",{"$f":"+IF('Acciones a Ejecutar'!$B19=\"si\",VLOOKUP('Datos basicos'!$B$29,Precios!$C$55:$E$58,2),0)","v":0},{"$f":"+IF('Acciones a Ejecutar'!$B19=\"si\",VLOOKUP('Datos basicos'!$B$29,Precios!$C$55:$E$58,3),0)","v":0},99,null,{"$f":"+Precios!D55","v":100000},{"$f":"+Precios!E58","v":6750000}]
[null,"Costo Reducción de personal por manuales",{"$f":"+IF('Acciones a Ejecutar'!$B19=\"si\",G52,0)","v":0},{"$f":"+IF('Acciones a Ejecutar'!$B19=\"si\",H52,0)","v":0},99,null,{"$f":"+H52*0.7","v":0},{"$f":"+'Premisas Beneficios'!C19*'Proyecciones Base'!C$21*15*'Datos basicos'!B$28/1000","v":0}]
[null,"Costo Reducción de personal por retiro",{"$f":"+IF('Acciones a Ejecutar'!$B20=\"si\",G53,0)","v":0},{"$f":"+IF('Acciones a Ejecutar'!$B20=\"si\",H53,0)","v":0},99,null,{"$f":"+H53*0.7","v":0},{"$f":"+'Premisas Beneficios'!C20*'Proyecciones Base'!C$21*15*'Datos basicos'!B$28/1000","v":0}]
[null,"Estudio Consumo Cuota Fija",{"$f":"+IF('Acciones a Ejecutar'!$B23=\"si\",VLOOKUP('Datos basicos'!$B$29,Precios!$C$60:$E$63,2),0)","v":0},{"$f":"+IF('Acciones a Ejecutar'!$B23=\"si\",VLOOKUP('Datos basicos'!$B$29,Precios!$C$60:$E$63,3),0)","v":0},99,null,{"$f":"+Precios!D60","v":100000},{"$f":"+Precios!E63","v":3200000}]
[null,"Adquisición e instalación de medidores",{"$f":"+IF('Acciones a Ejecutar'!$B24=\"si\",G55,0)","v":0},{"$f":"+IF('Acciones a Ejecutar'!$B24=\"si\",H55,0)","v":0},5,null,500,700]
[null,"Capacitación Ef. Comercial",{"$f":"+IF('Acciones a Ejecutar'!$B25=\"si\",VLOOKUP('Datos basicos'!$B$29,Precios!$C$65:$E$68,2),0)","v":0},{"$f":"+IF('Acciones a Ejecutar'!$B25=\"si\",VLOOKUP('Datos basicos'!$B$29,Precios!$C$65:$E$68,3),0)","v":0},5,null,{"$f":"+Precios!D65","v":50000},{"$f":"+Precios!E68","v":1350000}]
[null,"Capacitación Atención de usuarios",{"$f":"+IF('Acciones a Ejecutar'!$B26=\"si\",VLOOKUP('Datos basicos'!$B$29,Precios!$C$70:$E$73,2),0)","v":0},{"$f":"+IF('Acciones a Ejecutar'!$B26=\"si\",VLOOKUP('Datos basicos'!$B$29,Precios!$C$70:$E$73,3),0)","v":0},5,null,{"$f":"+Precios!D70","v":50000},{"$f":"+Precios!E73","v":900000}]
[null,"Asesoría convenios recaudadores",{"$f":"+IF('Acciones a Ejecutar'!$B27=\"si\",VLOOKUP('Datos basicos'!$B$29,Precios!$C$75:$E$78,2),0)","v":0},{"$f":"+IF('Acciones a Ejecutar'!$B27=\"si\",VLOOKUP('Datos basicos'!$B$29,Precios!$C$75:$E$78,3),0)","v":0},5,null,{"$f":"+Precios!D75","v":50000},{"$f":"+Precios!E78","v":600000}]
[null,"Implementación sistema comercial",{"$f":"+IF('Acciones a Ejecutar'!$B28=\"si\",G59,0)","v":0},{"$f":"+IF('Acciones a Ejecutar'!$B28=\"si\",H59,0)","v":0},5,null,{"$f":"25*'Proyecciones Base'!C21","v":0},{"$f":"1000000+30*'Proyecciones Base'!C21","v":1000000}]
[null,"Asesoría en esquema de cobranza",{"$f":"+IF('Acciones a Ejecutar'!$B29=\"si\",VLOOKUP('Datos basicos'!$B$29,Precios!$C$80:$E$83,2),0)","v":0},{"$f":"+IF('Acciones a Ejecutar'!$B29=\"si\",VLOOKUP('Datos basicos'!$B$29,Precios!$C$80:$E$83,3),0)","v":0},99,null,{"$f":"+Precios!D80","v":50000},{"$f":"+Precios!E83","v":337500}]
[null,"Campaña de búsqueda de clandesitnos",{"$f":"+IF('Acciones a Ejecutar'!$B30=\"si\",G61,0)","v":0},{"$f":"+IF('Acciones a Ejecutar'!$B30=\"si\",H61,0)","v":0},99,null,{"$f":"2*'Proyecciones Base'!C21","v":0},{"$f":"+G61*2","v":0}]
[null,"Censo de usuarios",{"$f":"+IF('Acciones a Ejecutar'!$B31=\"si\",G62,0)","v":0},{"$f":"+IF('Acciones a Ejecutar'!$B31=\"si\",H62,0)","v":0},99,null,{"$f":"50*'Proyecciones Base'!C21","v":0},{"$f":"+G62*2","v":0}]
[null,"Sistema informático de factibilidades",{"$f":"+IF('Acciones a Ejecutar'!$B32=\"si\",G63,0)","v":0},{"$f":"+IF('Acciones a Ejecutar'!$B32=\"si\",H63,0)","v":0},5,null,{"$f":"+G59*0.1","v":0},{"$f":"+H59*0.1","v":100000}]
[null,"Estudio Tarifario",{"$f":"+IF('Acciones a Ejecutar'!$B33=\"si\",G64,0)","v":0},{"$f":"+IF('Acciones a Ejecutar'!$B33=\"si\",H64,0)","v":0},5,null,{"$f":"1*'Proyecciones Base'!C21","v":0},{"$f":"+G64*3","v":0}]
[null,"Estudio estructura tarifaria",{"$f":"+IF('Acciones a Ejecutar'!$B34=\"si\",G65,0)","v":0},{"$f":"+IF('Acciones a Ejecutar'!$B34=\"si\",H65,0)","v":0},99,null,{"$f":"+G64*0.2","v":0},{"$f":"+H64*0.2","v":0}]
[null,"Estudio para polinomio tarifas y reformas legales",{"$f":"+IF('Acciones a Ejecutar'!$B35=\"si\",G66,0)","v":0},{"$f":"+IF('Acciones a Ejecutar'!$B35=\"si\",H66,0)","v":0},99,null,{"$f":"+G64","v":0},{"$f":"+H64","v":0}]
[null,"Estudio de reformas a la Ley por tarifas",{"$f":"+IF('Acciones a Ejecutar'!$B36=\"si\",G67,0)","v":0},{"$f":"+IF('Acciones a Ejecutar'!$B36=\"si\",H67,0)","v":0},99,null,{"$f":"+G66","v":0},{"$f":"+H66","v":0}]
[null,{"$f":"+'Premisas Inversiones'!B39","v":"Costo Total fugas tanque"},{"$f":"+IF('Acciones a Ejecutar'!$B39=\"si\",G68,0)","v":0},{"$f":"+IF('Acciones a Ejecutar'!$B39=\"si\",H68,0)","v":0},99,null,0,{"$f":"30000*PerdidasTanque!$C$70","v":0}]
[null,{"$f":"+'Premisas Inversiones'!B40","v":"Costo localización y reparación fugas"},{"$f":"+IF('Acciones a Ejecutar'!$B40=\"si\",G69,0)","v":0},{"$f":"+IF('Acciones a Ejecutar'!$B40=\"si\",H69,0)","v":0},99,null,0,{"$f":"+'Proyecciones Base'!C20*20","v":0}]
[null,{"$f":"+'Premisas Inversiones'!B41","v":"Instalación nuevos micromedidores"},{"$f":"+IF('Acciones a Ejecutar'!$B41=\"si\",G70,0)","v":0},{"$f":"+IF('Acciones a Ejecutar'!$B41=\"si\",H70,0)","v":0},5,null,500,1000]
[null,{"$f":"+'Premisas Inversiones'!B42","v":"Sistema de lectura automático micro"},{"$f":"+IF('Acciones a Ejecutar'!$B42=\"si\",G71,0)","v":0},{"$f":"+IF('Acciones a Ejecutar'!$B42=\"si\",H71,0)","v":0},5,null,{"$f":"+ROUNDUP('Proyecciones Base'!H22*1.1/(400*IF(Practicas!$C$19=\"mensual\",20,IF(Practicas!$C$19=\"bimestral\",40,IF(Practicas!$C$19=\"semestral\",120,240)))),0)*20000","v":0},{"$f":"+G71*2","v":0}]
[null,{"$f":"+'Premisas Inversiones'!B43","v":"Sectorización"},{"$f":"+IF('Acciones a Ejecutar'!$B43=\"si\",G72,0)","v":0},{"$f":"+IF('Acciones a Ejecutar'!$B43=\"si\",H72,0)","v":0},15,null,{"$f":"+H72*0.1","v":0},{"$f":"200*'Proyecciones Base'!C20","v":0}]
[null,{"$f":"+'Premisas Inversiones'!B44","v":"Catastro de redes"},{"$f":"+IF('Acciones a Ejecutar'!$B44=\"si\",G73,0)","v":0},{"$f":"+IF('Acciones a Ejecutar'!$B44=\"si\",H73,0)","v":0},20,null,{"$f":"+H73*0.1","v":0},{"$f":"200*'Proyecciones Base'!C20","v":0}]
[null,{"$f":"+'Premisas Inversiones'!B45","v":"Macromedición en captaciones"},{"$f":"+IF('Acciones a Ejecutar'!$B45=\"si\",G74,0)","v":0},{"$f":"+IF('Acciones a Ejecutar'!$B45=\"si\",H74,0)","v":0},8,null,{"$f":"+H74*0.05","v":0},{"$f":"400000*Produccion!$I$159","v":0}]
[null,{"$f":"+'Premisas Inversiones'!B46","v":"Macromedición en sectores"},{"$f":"+IF('Acciones a Ejecutar'!$B46=\"si\",G75,0)","v":0},{"$f":"+IF('Acciones a Ejecutar'!$B46=\"si\",H75,0)","v":0},8,null,{"$f":"+H75/5","v":0},{"$f":"1000000*'Proyecciones Base'!C20/10000","v":0}]
[null,{"$f":"+'Premisas Inversiones'!B47","v":"Automatización lectura macromedidores"},{"$f":"+IF('Acciones a Ejecutar'!$B47=\"si\",G76,0)","v":0},{"$f":"+IF('Acciones a Ejecutar'!$B47=\"si\",H76,0)","v":0},5,null,{"$f":"+H76*0.3","v":0},{"$f":"+('Proyecciones Base'!C20/10000+Produccion!$H$159+Produccion!$I$159)*100000","v":0}]
[null,{"$f":"+'Premisas Inversiones'!B48","v":"Sustitución tuberías por fugas"},{"$f":"+IF('Acciones a Ejecutar'!$B48=\"si\",G77,0)","v":0},{"$f":"+IF('Acciones a Ejecutar'!$B48=\"si\",H77,0)","v":0},30,null,{"$f":"+H77*0.3","v":0},{"$f":"0.2*'Proyecciones Base'!C20*20000/10","v":0}]
[null,{"$f":"+'Premisas Inversiones'!B49","v":"Capacitación en operaciones"},{"$f":"+IF('Acciones a Ejecutar'!$B49=\"si\",G78,0)","v":0},{"$f":"+IF('Acciones a Ejecutar'!$B49=\"si\",H78,0)","v":0},5,null,{"$f":"+H78*0.1","v":0},{"$f":"14*'Proyecciones Base'!C20","v":0}]
[null,{"$f":"+'Premisas Inversiones'!B50","v":"GIS"},{"$f":"+IF('Acciones a Ejecutar'!$B50=\"si\",G79,0)","v":0},{"$f":"+IF('Acciones a Ejecutar'!$B50=\"si\",H79,0)","v":0},10,null,{"$f":"+H79*0.1","v":0},{"$f":"50*'Proyecciones Base'!C20","v":0}]
[null,"Número de captaciones",{"$f":"+IF('Acciones a Ejecutar'!$B45=\"si\",G80,0)","v":0},{"$f":"+IF('Acciones a Ejecutar'!$B45=\"si\",H80,0)","v":0},null,null,0,{"$f":"+Produccion!$C$159","v":0}]
[null,"Número de sectores",{"$f":"+IF('Acciones a Ejecutar'!$B46=\"si\",G81,0)","v":0},{"$f":"+IF('Acciones a Ejecutar'!$B46=\"si\",H81,0)","v":0},null,null,1,{"$f":"+'Proyecciones Base'!C21/2000","v":0}]
[null,{"$f":"+'Premisas Inversiones'!B53","v":"Estudio Consejo ciudadanizado"},{"$f":"+IF('Acciones a Ejecutar'!$B53=\"si\",VLOOKUP('Datos basicos'!$B$29,Precios!$C$85:$E$88,2),0)","v":0},{"$f":"+IF('Acciones a Ejecutar'!$B53=\"si\",VLOOKUP('Datos basicos'!$B$29,Precios!$C$85:$E$88,3),0)","v":0},99,null,{"$f":"+Precios!D85","v":100000},{"$f":"+Precios!E88","v":1350000}]
[null,{"$f":"+'Premisas Inversiones'!B54","v":"Estudio Código de ética"},{"$f":"+IF('Acciones a Ejecutar'!$B54=\"si\",VLOOKUP('Datos basicos'!$B$29,Precios!$C$90:$E$93,2),0)","v":0},{"$f":"+IF('Acciones a Ejecutar'!$B54=\"si\",VLOOKUP('Datos basicos'!$B$29,Precios!$C$90:$E$93,3),0)","v":0},99,null,{"$f":"+Precios!D90","v":100000},{"$f":"+Precios!E93","v":1350000}]
[null,{"$f":"+'Premisas Inversiones'!B55","v":"Sistema Contable"},{"$f":"+IF('Acciones a Ejecutar'!$B55=\"si\",G84,0)","v":0},{"$f":"+IF('Acciones a Ejecutar'!$B55=\"si\",H84,0)","v":0},5,null,{"$f":"+'Proyecciones Base'!C21*20","v":0},{"$f":"+G84*1.5","v":0}]
[null,{"$f":"+'Premisas Inversiones'!B56","v":"Asesoría sistema planeación"},{"$f":"+IF('Acciones a Ejecutar'!$B56=\"si\",VLOOKUP('Datos basicos'!$B$29,Precios!$C$95:$E$98,2),0)","v":0},{"$f":"+IF('Acciones a Ejecutar'!$B56=\"si\",VLOOKUP('Datos basicos'!$B$29,Precios!$C$95:$E$98,3),0)","v":0},10,null,{"$f":"+Precios!D95","v":400000},{"$f":"+Precios!E98","v":2700000}]
[null,{"$f":"+'Premisas Inversiones'!B57","v":"Financiamiento contraparte"},{"$f":"+IF('Acciones a Ejecutar'!$B57=\"si\",VLOOKUP('Datos basicos'!$B$29,Precios!$C$100:$E$103,2),0)","v":0},{"$f":"+IF('Acciones a Ejecutar'!$B57=\"si\",VLOOKUP('Datos basicos'!$B$29,Precios!$C$100:$E$103,3),0)","v":0},99,null,{"$f":"+Precios!D100","v":400000},{"$f":"+Precios!E103","v":2025000}]
[null,{"$f":"+'Premisas OPEX'!B27","v":"Costo anual cobranza externa"},{"$f":"+IF('Acciones a Ejecutar'!$B27=\"si\",G87,0)","v":0},{"$f":"+IF('Acciones a Ejecutar'!$B27=\"si\",H87,0)","v":0},null,null,{"$f":"5*'Premisas Beneficios'!C27*'Proyecciones Base'!C21*12","v":0},{"$f":"3*G87","v":0}]
[null,{"$f":"+'Premisas OPEX'!B28","v":"Costo anual de mantenimiento y licenciamiento del SC"},{"$f":"+IF('Acciones a Ejecutar'!$B28=\"si\",G88,0)","v":0},{"$f":"+IF('Acciones a Ejecutar'!$B28=\"si\",H88,0)","v":0},null,null,{"$f":"+G59*0.1","v":0},{"$f":"+H59*0.1","v":100000}]
[null,{"$f":"+'Premisas OPEX'!B29","v":"Costo anual de esquema de cobranza"},{"$f":"+IF('Acciones a Ejecutar'!$B29=\"si\",G89,0)","v":0},{"$f":"+IF('Acciones a Ejecutar'!$B29=\"si\",H89,0)","v":0},null,null,0,{"$f":"+H22*'Proyecciones Base'!C14*0.5","v":0}]
[null,{"$f":"+'Premisas OPEX'!B31","v":"Mantención del Censo de usuarios"},{"$f":"+IF('Acciones a Ejecutar'!$B31=\"si\",G90,0)","v":0},{"$f":"+IF('Acciones a Ejecutar'!$B31=\"si\",H90,0)","v":0},null,null,0,{"$f":"IFERROR(0.005*'Datos basicos'!B24*2/'Datos basicos'!B26,0)","v":0}]
[null,{"$f":"+'Premisas OPEX'!B41","v":"Lectura de nuevos medidores"},{"$f":"+IF('Acciones a Ejecutar'!$B41=\"si\",G91,0)","v":0},{"$f":"+IF('Acciones a Ejecutar'!$B41=\"si\",H91,0)","v":0},null,null,{"$f":"'Acciones a Ejecutar'!D41*IF(Practicas!$C$19=\"mensual\",12,IF(Practicas!$C$19=\"bimestral\",6,IF(Practicas!$C$19=\"semestral\",2,1)))*1.2","v":0},{"$f":"+G91*2","v":0}]
[null,{"$f":"+'Premisas OPEX'!B56","v":"Costo adicional del área de planeación"},{"$f":"+IF('Acciones a Ejecutar'!$B56=\"si\",G92,0)","v":0},{"$f":"+IF('Acciones a Ejecutar'!$B56=\"si\",H92,0)","v":0},null,null,0,{"$f":"IFERROR(0.01*'Datos basicos'!B24*2/'Datos basicos'!B26,0)","v":0}]

{"sheet":"Proyecciones Base","index":34,"n_rows":42,"n_cols":24,"rows_kept":42,"cut":false,"hidden":true,"merged":[[3,2,3,9],[4,2,4,9]]}
[]
[null,"Formato Evaluación 10. PROYECCIONES PARA EVALUACION"]
[]
[null,"NOMBRE:",{"$f":"+'Acciones a Ejecutar'!B4","v":"X"}]
[null,"AÑO:",{"$f":"+'Acciones a Ejecutar'!B5","v":0}]
[]
[null,null,{"$f":"+Datos!C6","v":0},{"$f":"+C7+1","v":1},2,3,4,5,6,7,8,9,10,11,12,13,14,15,16,17,18,19,20,21]
[null,null,0,{"$f":"1+C8","v":1},2,3,4,5,6,7,8,9,10,11,12,13,14,15,16,17,18,19,20,21]
[null,"Población CONAPO",null,null,null,null,null,null,null,null,null,null,null,null,null,null,null,null,{"$f":"+R9*S10","v":0},0,0,0,0,0]
[null,"Factor de Crecimiento",null,{"$f":"IFERROR(D9/C9,0)","v":0},0,0,0,0,0,0,0,0,0,0,0,0,0,0,{"$f":"+R10","v":0},0,0,0,0,0]
[null,"Tarifa Servicio Cuota Fija $/toma/año PROYECTADO NO CALENDARIZADO",{"$f":"+Indicadores!$D$49","v":0},{"$f":"+C11*(1+'Datos basicos'!B10)","v":0},{"$f":"+D11","v":0},0,0,0,0,0,0,0,0,0,0,0,0,0,0,0,0,0,0,0]
[null,"Tarifa Servicio Medido $/toma/año PROYECTADO NO CALENDARIZADO",{"$f":"+Indicadores!$D$48","v":0},{"$f":"+C12*(1+'Datos basicos'!B11)","v":0},{"$f":"+D12","v":0},0,0,0,0,0,0,0,0,0,0,0,0,0,0,0,0,0,0,0]
[null,"Tarifa Media ($/toma/año) PROYECTADO NO CALENDARIZADO",{"$f":"IFERROR(C12*C22/C21+C11*C23/C21,0)","v":0},{"$f":"IFERROR(D12*D22*(1+'Datos basicos'!$B$9)/D21+D11*D23/D21,0)","v":0},{"$f":"IFERROR(E12*E22*(1+'Datos basicos'!$B$9)/E21+E11*E23/E21,0)","v":0},{"$f":"IFERROR(F12*F22*(1+'Datos basicos'!$B$9)/F21+F11*F23/F21,0)","v":0},{"$f":"IFERROR(G12*G22*(1+'Datos basicos'!$B$9)/G21+G11*G23/G21,0)","v":0},{"$f":"IFERROR(H12*H22*(1+'Datos basicos'!$B$9)/H21+H11*H23/H21,0)","v":0},{"$f":"IFERROR(I12*I22*(1+'Datos basicos'!$B$9)/I21+I11*I23/I21,0)","v":0},{"$f":"IFERROR(J12*J22*(1+'Datos basicos'!$B$9)/J21+J11*J23/J21,0)","v":0},{"$f":"IFERROR(K12*K22*(1+'Datos basicos'!$B$9)/K21+K11*K23/K21,0)","v":0},{"$f":"IFERROR(L12*L22*(1+'Datos basicos'!$B$9)/L21+L11*L23/L21,0)","v":0},{"$f":"IFERROR(M12*M22*(1+'Datos basicos'!$B$9)/M21+M11*M23/M21,0)","v":0},{"$f":"IFERROR(N12*N22*(1+'Datos basicos'!$B$9)/N21+N11*N23/N21,0)","v":0},{"$f":"IFERROR(O12*O22*(1+'Datos basicos'!$B$9)/O21+O11*O23/O21,0)","v":0},{"$f":"IFERROR(P12*P22*(1+'Datos basicos'!$B$9)/P21+P11*P23/P21,0)","v":0},{"$f":"IFERROR(Q12*Q22*(1+'Datos basicos'!$B$9)/Q21+Q11*Q23/Q21,0)","v":0},{"$f":"IFERROR(R12*R22*(1+'Datos basicos'!$B$9)/R21+R11*R23/R21,0)","v":0},{"$f":"IFERROR(S12*S22*(1+'Datos basicos'!$B$9)/S21+S11*S23/S21,0)","v":0},{"$f":"IFERROR(T12*T22*(1+'Datos basicos'!$B$9)/T21+T11*T23/T21,0)","v":0},{"$f":"IFERROR(U12*U22*(1+'Datos basicos'!$B$9)/U21+U11*U23/U21,0)","v":0},{"$f":"IFERROR(V12*V22*(1+'Datos basicos'!$B$9)/V21+V11*V23/V21,0)","v":0},{"$f":"IFERROR(W12*W22*(1+'Datos basicos'!$B$9)/W21+W11*W23/W21,0)","v":0},{"$f":"IFERROR(X12*X22*(1+'Datos basicos'!$B$9)/X21+X11*X23/X21,0)","v":0}]
[null,"Facturación por suministro de AP, Alc. y saneamiento ($) BASE",{"$f":"+Datos!$E$53","v":0},{"$f":"+C14*D10","v":0},0,0,0,0,0,0,0,0,0,0,0,0,0,0,0,0,0,0,0,0]
[null,"Facturación por suministro de AP, Alc. y saneamiento ($) PROYECTADA",{"$f":"+C21*C13","v":0},0,0,0,0,0,0,0,0,0,0,0,0,0,0,0,0,0,0,0,0,0]
[null,"Ingresos por suministro de agua potable",{"$f":"+Datos!$E$54","v":0},{"$f":"+D15*D17","v":0},{"$f":"+E15*E17","v":0},0,0,0,0,0,0,0,0,0,0,0,0,0,0,0,0,0,0,0]
[null,"Eficiencia comercial con nuevo sistema",{"$f":"IFERROR(C16/C14,0)","v":0},{"$f":"C17+'Premisas Beneficios'!$C$28*Evaluacion!O$24","v":0},{"$f":"D17+'Premisas Beneficios'!$C$28*Evaluacion!P$24","v":0},{"$f":"E17+'Premisas Beneficios'!$C$28*Evaluacion!Q$24","v":0},{"$f":"F17+'Premisas Beneficios'!$C$28*Evaluacion!R$24","v":0},{"$f":"G17+'Premisas Beneficios'!$C$28*Evaluacion!S$24","v":0},{"$f":"+H17","v":0},0,0,0,0,0,0,0,0,0,0,0,0,0,0,0]
[null,"Tomas Domésticas BASE",{"$f":"+'Tomas y coberturas'!C10","v":0},{"$f":"+C18*D10","v":0},{"$f":"+D18*E10","v":0},0,0,0,0,0,0,0,0,0,0,0,0,0,0,0,0,0,0,0]
[null,"Tomas Domésticas PROYECTADAS",{"$f":"+C18","v":0},{"$f":"+C22*D10*(1+'Datos basicos'!B12)","v":0},{"$f":"+D19*D10","v":0},{"$f":"+E19*E10","v":0},0,0,0,0,0,0,0,0,0,0,0,0,0,0,0,0,0,0]
[null,"Tomas Totales BASE",{"$f":"+C22+C23","v":0},{"$f":"+C20*D10","v":0},0,0,0,0,0,0,0,0,0,0,0,0,0,0,0,0,0,0,0,0]
[null,"Tomas Totales PROYECTADAS",{"$f":"+C22+C23","v":0},0,0,0,0,0,0,0,0,0,0,0,0,0,0,0,0,0,0,0,0,0]
[null,"Tomas Medidas PROYECTADAS",{"$f":"+'Tomas y coberturas'!$D$15","v":0},{"$f":"+(C22+'Acciones a Ejecutar'!$D$41*Evaluacion!O42)*D10*(1+'Datos basicos'!$B$12*Evaluacion!O32)","v":0},{"$f":"+(D22+'Acciones a Ejecutar'!$D$41*Evaluacion!P42)*E10*(1+'Datos basicos'!$B$12*Evaluacion!P32)","v":0},{"$f":"+(E22+'Acciones a Ejecutar'!$D$41*Evaluacion!Q42)*F10*(1+'Datos basicos'!$B$12*Evaluacion!Q32)","v":0},{"$f":"+(F22+'Acciones a Ejecutar'!$D$41*Evaluacion!R42)*G10*(1+'Datos basicos'!$B$12*Evaluacion!R32)","v":0},{"$f":"+(G22+'Acciones a Ejecutar'!$D$41*Evaluacion!S42)*H10*(1+'Datos basicos'!$B$12*Evaluacion!S32)","v":0},{"$f":"+H22*I10","v":0},0,0,0,0,0,0,0,0,0,0,0,0,0,0,0]
[null,"Tomas Cuota Fija PROYECTADAS",{"$f":"+'Tomas y coberturas'!$G$15","v":0},{"$f":"+(C23-'Acciones a Ejecutar'!$D$41*Evaluacion!O42)*(1+'Datos basicos'!$B$12*Evaluacion!O32)","v":0},{"$f":"+(D23-'Acciones a Ejecutar'!$D$41*Evaluacion!P42)*(1+'Datos basicos'!$B$12*Evaluacion!P32)","v":0},{"$f":"+(E23-'Acciones a Ejecutar'!$D$41*Evaluacion!Q42)*(1+'Datos basicos'!$B$12*Evaluacion!Q32)","v":0},{"$f":"+(F23-'Acciones a Ejecutar'!$D$41*Evaluacion!R42)*(1+'Datos basicos'!$B$12*Evaluacion!R32)","v":0},{"$f":"+(G23-'Acciones a Ejecutar'!$D$41*Evaluacion!S42)*(1+'Datos basicos'!$B$12*Evaluacion!S32)","v":0},{"$f":"+H23*I10","v":0},0,0,0,0,0,0,0,0,0,0,0,0,0,0,0]
[null,"Gastos de energía BASE",{"$f":"+C25","v":0},{"$f":"IFERROR(C24*D27/C27,0)","v":0},0,0,0,0,0,0,0,0,0,0,0,0,0,0,0,0,0,0,0,0]
[null,"Gastos de energía PROYECTADA",{"$f":"+Costos!$C$31","v":0},{"$f":"IFERROR(C25*(1-'Datos basicos'!B17)*D27/C27,0)","v":0},{"$f":"IFERROR(D25*(1-'Datos basicos'!C17)*E27/D27,0)","v":0},{"$f":"IFERROR(E25*(1-'Datos basicos'!D17)*F27/E27,0)","v":0},{"$f":"IFERROR(F25*(1-'Datos basicos'!E17)*G27/F27,0)","v":0},{"$f":"IFERROR(G25*(1-'Datos basicos'!F17)*H27/G27,0)","v":0},{"$f":"IFERROR(H25*(1-'Datos basicos'!#REF!)*I27/H27,0)","v":0},{"$f":"IFERROR(I25*(1-'Datos basicos'!G17)*J27/I27,0)","v":0},{"$f":"IFERROR(J25*(1-'Datos basicos'!H17)*K27/J27,0)","v":0},{"$f":"IFERROR(K25*(1-'Datos basicos'!I17)*L27/K27,0)","v":0},{"$f":"IFERROR(L25*(1-'Datos basicos'!J17)*M27/L27,0)","v":0},{"$f":"IFERROR(M25*(1-'Datos basicos'!K17)*N27/M27,0)","v":0},{"$f":"IFERROR(N25*(1-'Datos basicos'!L17)*O27/N27,0)","v":0},{"$f":"IFERROR(O25*(1-'Datos basicos'!M17)*P27/O27,0)","v":0},{"$f":"IFERROR(P25*(1-'Datos basicos'!N17)*Q27/P27,0)","v":0},{"$f":"IFERROR(Q25*(1-'Datos basicos'!O17)*R27/Q27,0)","v":0},{"$f":"IFERROR(R25*(1-'Datos basicos'!P17)*S27/R27,0)","v":0},{"$f":"IFERROR(S25*(1-'Datos basicos'!Q17)*T27/S27,0)","v":0},{"$f":"IFERROR(T25*(1-'Datos basicos'!R17)*U27/T27,0)","v":0},{"$f":"IFERROR(U25*(1-'Datos basicos'!S17)*V27/U27,0)","v":0},{"$f":"IFERROR(V25*(1-'Datos basicos'!T17)*W27/V27,0)","v":0},{"$f":"IFERROR(W25*(1-'Datos basicos'!U17)*X27/W27,0)","v":0}]
[null,"Facturación anual (m3)",{"$f":"+Datos!$E$35","v":0},{"$f":"+C26*D10*('Datos basicos'!B9+1)*(1+'Datos basicos'!B12)","v":0},{"$f":"+D26*E10","v":0},0,0,0,0,0,0,0,0,0,0,0,0,0,0,0,0,0,0,0]
[null,"Producción anual (m3)",{"$f":"+Datos!$E$29","v":0},{"$f":"IFERROR(D26/D28,0)","v":0},0,0,0,0,0,0,0,0,0,0,0,0,0,0,0,0,0,0,0,0]
[null,"Eficiencia Física",{"$f":"IFERROR(C26/C27,0)","v":0},{"$f":"+C28+'Datos basicos'!B15","v":0},{"$f":"+D28","v":0},0,0,0,0,0,0,0,0,0,0,0,0,0,0,0,0,0,0,0]
[null,"Facturación anual por toma cuota fija ($/toma/año) INTEGRADA",{"$f":"+C11","v":0},{"$f":"+C29+$C29*IF(Evaluacion!O$24<>0,'Premisas Beneficios'!$C$23*Evaluacion!O$24,0)+$C29*IF(Evaluacion!O$34<>0,'Premisas Beneficios'!$C$33*Evaluacion!O$34,0)+ $C29*IF(Evaluacion!O$35<>0,'Premisas Beneficios'!$C$34*Evaluacion!O$35,0)","v":0},{"$f":"+D29+$C29*IF(Evaluacion!P$24<>0,'Premisas Beneficios'!$C$23*Evaluacion!P$24,0)+$C29*IF(Evaluacion!P$34<>0,'Premisas Beneficios'!$C$33*Evaluacion!P$34,0)+ $C29*IF(Evaluacion!P$35<>0,'Premisas Beneficios'!$C$34*Evaluacion!P$35,0)","v":0},{"$f":"+E29+$C29*IF(Evaluacion!Q$24<>0,'Premisas Beneficios'!$C$23*Evaluacion!Q$24,0)+$C29*IF(Evaluacion!Q$34<>0,'Premisas Beneficios'!$C$33*Evaluacion!Q$34,0)+ $C29*IF(Evaluacion!Q$35<>0,'Premisas Beneficios'!$C$34*Evaluacion!Q$35,0)","v":0},{"$f":"+F29+$C29*IF(Evaluacion!R$24<>0,'Premisas Beneficios'!$C$23*Evaluacion!R$24,0)+$C29*IF(Evaluacion!R$34<>0,'Premisas Beneficios'!$C$33*Evaluacion!R$34,0)+ $C29*IF(Evaluacion!R$35<>0,'Premisas Beneficios'!$C$34*Evaluacion!R$35,0)","v":0},{"$f":"+G29+$C29*IF(Evaluacion!S$24<>0,'Premisas Beneficios'!$C$23*Evaluacion!S$24,0)+$C29*IF(Evaluacion!S$34<>0,'Premisas Beneficios'!$C$33*Evaluacion!S$34,0)+ $C29*IF(Evaluacion!S$35<>0,'Premisas Beneficios'!$C$34*Evaluacion!S$35,0)","v":0},{"$f":"+H29","v":0},0,0,0,0,0,0,0,0,0,0,0,0,0,0,0]
[null,"Facturación anual por toma  servicio medido ($/toma/año) INTEGRADA",{"$f":"+C12","v":0},{"$f":"+C30+$C30*IF(Evaluacion!O$34<>0,'Premisas Beneficios'!$C$33*Evaluacion!O$34,0)+ $C30*IF(Evaluacion!O$35<>0,'Premisas Beneficios'!$C$34*Evaluacion!O$35,0)","v":0},{"$f":"+D30+$C30*IF(Evaluacion!P$34<>0,'Premisas Beneficios'!$C$33*Evaluacion!P$34,0)+ $C30*IF(Evaluacion!P$35<>0,'Premisas Beneficios'!$C$34*Evaluacion!P$35,0)","v":0},{"$f":"+E30+$C30*IF(Evaluacion!Q$34<>0,'Premisas Beneficios'!$C$33*Evaluacion!Q$34,0)+ $C30*IF(Evaluacion!Q$35<>0,'Premisas Beneficios'!$C$34*Evaluacion!Q$35,0)","v":0},{"$f":"+F30+$C30*IF(Evaluacion!R$34<>0,'Premisas Beneficios'!$C$33*Evaluacion!R$34,0)+ $C30*IF(Evaluacion!R$35<>0,'Premisas Beneficios'!$C$34*Evaluacion!R$35,0)","v":0},{"$f":"+G30+$C30*IF(Evaluacion!S$34<>0,'Premisas Beneficios'!$C$33*Evaluacion!S$34,0)+ $C30*IF(Evaluacion!S$35<>0,'Premisas Beneficios'!$C$34*Evaluacion!S$35,0)","v":0},{"$f":"+H30","v":0},0,0,0,0,0,0,0,0,0,0,0,0,0,0,0]
[null,"Tarifa Media ($/toma/año) PROYECTADO CALENDARIZADO",{"$f":"+C13","v":0},{"$f":"IFERROR(D30*D22/D21+D29*D23/D21,0)","v":0},{"$f":"IFERROR(E30*E22/E21+E29*E23/E21,0)","v":0},{"$f":"IFERROR(F30*F22/F21+F29*F23/F21,0)","v":0},{"$f":"IFERROR(G30*G22/G21+G29*G23/G21,0)","v":0},{"$f":"IFERROR(H30*H22/H21+H29*H23/H21,0)","v":0},{"$f":"+H31","v":0},0,0,0,0,0,0,0,0,0,0,0,0,0,0,0]
[null,"Tomas PROYECTADO CALENDARIZADO",{"$f":"+C20","v":0},{"$f":"+C32*D10+$C32*IF(Evaluacion!O$33<>0,'Premisas Beneficios'!$C$31*Evaluacion!O$33,0)+ $C32*IF(Evaluacion!O$33<>0,'Premisas Beneficios'!$C$32*Evaluacion!O$33,0)","v":0},{"$f":"+D32*E10+$C32*IF(Evaluacion!P$33<>0,'Premisas Beneficios'!$C$31*Evaluacion!P$33,0)+ $C32*IF(Evaluacion!P$33<>0,'Premisas Beneficios'!$C$32*Evaluacion!P$33,0)","v":0},{"$f":"+E32*F10+$C32*IF(Evaluacion!Q$33<>0,'Premisas Beneficios'!$C$31*Evaluacion!Q$33,0)+ $C32*IF(Evaluacion!Q$33<>0,'Premisas Beneficios'!$C$32*Evaluacion!Q$33,0)","v":0},{"$f":"+F32*G10+$C32*IF(Evaluacion!R$33<>0,'Premisas Beneficios'!$C$31*Evaluacion!R$33,0)+ $C32*IF(Evaluacion!R$33<>0,'Premisas Beneficios'!$C$32*Evaluacion!R$33,0)","v":0},{"$f":"+G32*H10+$C32*IF(Evaluacion!S$33<>0,'Premisas Beneficios'!$C$31*Evaluacion!S$33,0)+ $C32*IF(Evaluacion!S$33<>0,'Premisas Beneficios'!$C$32*Evaluacion!S$33,0)","v":0},{"$f":"+H32*I10","v":0},{"$f":"+I32*J10","v":0},0,0,0,0,0,0,0,0,0,0,0,0,0,0]
[null,"Tomas domésticas PROYECTADO CALENDARIZADO",{"$f":"+C18","v":0},{"$f":"+C33*D10+$C33*IF(Evaluacion!O$33<>0,'Premisas Beneficios'!$C$31*Evaluacion!O$33,0)+ $C33*IF(Evaluacion!O$33<>0,'Premisas Beneficios'!$C$32*Evaluacion!O$33,0)","v":0},{"$f":"+D33*E10+$C33*IF(Evaluacion!P$33<>0,'Premisas Beneficios'!$C$31*Evaluacion!P$33,0)+ $C33*IF(Evaluacion!P$33<>0,'Premisas Beneficios'!$C$32*Evaluacion!P$33,0)","v":0},{"$f":"+E33*F10+$C33*IF(Evaluacion!Q$33<>0,'Premisas Beneficios'!$C$31*Evaluacion!Q$33,0)+ $C33*IF(Evaluacion!Q$33<>0,'Premisas Beneficios'!$C$32*Evaluacion!Q$33,0)","v":0},{"$f":"+F33*G10+$C33*IF(Evaluacion!R$33<>0,'Premisas Beneficios'!$C$31*Evaluacion!R$33,0)+ $C33*IF(Evaluacion!R$33<>0,'Premisas Beneficios'!$C$32*Evaluacion!R$33,0)","v":0},{"$f":"+G33*H10+$C33*IF(Evaluacion!S$33<>0,'Premisas Beneficios'!$C$31*Evaluacion!S$33,0)+ $C33*IF(Evaluacion!S$33<>0,'Premisas Beneficios'!$C$32*Evaluacion!S$33,0)","v":0},{"$f":"+H33*I10","v":0},{"$f":"+I33*J10","v":0},0,0,0,0,0,0,0,0,0,0,0,0,0,0]
[null,"Tomas medidas PROYECTADO CALENDARIZADO",{"$f":"+C22","v":0},{"$f":"IFERROR(MIN(C34*D32/C32+IF(Evaluacion!O$42<>0,'Acciones a Ejecutar'!$D$41*Evaluacion!O$42,0),D32),0)","v":0},{"$f":"IFERROR(MIN(D34*E32/D32+IF(Evaluacion!P$42<>0,'Acciones a Ejecutar'!$D$41*Evaluacion!P$42,0),E32),0)","v":0},{"$f":"IFERROR(MIN(E34*F32/E32+IF(Evaluacion!Q$42<>0,'Acciones a Ejecutar'!$D$41*Evaluacion!Q$42,0),F32),0)","v":0},{"$f":"IFERROR(MIN(F34*G32/F32+IF(Evaluacion!R$42<>0,'Acciones a Ejecutar'!$D$41*Evaluacion!R$42,0),G32),0)","v":0},{"$f":"IFERROR(MIN(G34*H32/G32+IF(Evaluacion!S$42<>0,'Acciones a Ejecutar'!$D$41*Evaluacion!S$42,0),H32),0)","v":0},{"$f":"IFERROR(MIN(H34*I32/H32,I32),0)","v":0},{"$f":"IFERROR(MIN(I34*J32/I32,J32),0)","v":0},0,0,0,0,0,0,0,0,0,0,0,0,0,0]
[null,"Cobertura micromedición PROYECTADO CALENDARIZADO",{"$f":"IFERROR(C34/C32,0)","v":0},0,0,0,0,0,0,{"$f":"IFERROR(J34/J32,0)","v":0},0,0,0,0,0,0,0,0,0,0,0,0,0,0]
[null,"Cobertura AP PROYECTADO CALENDARIZADO",{"$f":"IFERROR(C33*'Datos basicos'!$B$23/C9,0)","v":0},{"$f":"MIN(IFERROR(D33*'Datos basicos'!$B$23/D9,0),100%)","v":0},{"$f":"MIN(IFERROR(E33*'Datos basicos'!$B$23/E9,0),100%)","v":0},{"$f":"MIN(IFERROR(F33*'Datos basicos'!$B$23/F9,0),100%)","v":0},{"$f":"MIN(IFERROR(G33*'Datos basicos'!$B$23/G9,0),100%)","v":0},{"$f":"MIN(IFERROR(H33*'Datos basicos'!$B$23/H9,0),100%)","v":0},{"$f":"MIN(IFERROR(I33*'Datos basicos'!$B$23/I9,0),100%)","v":0},{"$f":"MIN(IFERROR(J33*'Datos basicos'!$B$23/J9,0),100%)","v":0},{"$f":"MIN(IFERROR(K33*'Datos basicos'!$B$23/K9,0),100%)","v":0},{"$f":"MIN(IFERROR(L33*'Datos basicos'!$B$23/L9,0),100%)","v":0},{"$f":"MIN(IFERROR(M33*'Datos basicos'!$B$23/M9,0),100%)","v":0},{"$f":"MIN(IFERROR(N33*'Datos basicos'!$B$23/N9,0),100%)","v":0},{"$f":"MIN(IFERROR(O33*'Datos basicos'!$B$23/O9,0),100%)","v":0},{"$f":"MIN(IFERROR(P33*'Datos basicos'!$B$23/P9,0),100%)","v":0},{"$f":"MIN(IFERROR(Q33*'Datos basicos'!$B$23/Q9,0),100%)","v":0},{"$f":"MIN(IFERROR(R33*'Datos basicos'!$B$23/R9,0),100%)","v":0},{"$f":"MIN(IFERROR(S33*'Datos basicos'!$B$23/S9,0),100%)","v":0},{"$f":"MIN(IFERROR(T33*'Datos basicos'!$B$23/T9,0),100%)","v":0},{"$f":"MIN(IFERROR(U33*'Datos basicos'!$B$23/U9,0),100%)","v":0},{"$f":"MIN(IFERROR(V33*'Datos basicos'!$B$23/V9,0),100%)","v":0},{"$f":"MIN(IFERROR(W33*'Datos basicos'!$B$23/W9,0),100%)","v":0},{"$f":"MIN(IFERROR(X33*'Datos basicos'!$B$23/X9,0),100%)","v":0}]
[null,"Eficiencia Comercial PROYECTADO CALENDARIZADO",{"$f":"+C17","v":0},{"$f":"MIN(C37+IF(Evaluacion!O$26<>0,'Premisas Beneficios'!$C$25*Evaluacion!O$26,0)+IF(Evaluacion!O$27<>0,'Premisas Beneficios'!$C$26*Evaluacion!O$27,0)+IF(Evaluacion!O$28<>0,'Premisas Beneficios'!$C$27*Evaluacion!O$28,0)+IF(Evaluacion!O$29<>0,'Premisas Beneficios'!$C$28*Evaluacion!O$29<>0,0)+IF(Evaluacion!O$30<>0,'Premisas Beneficios'!$C$29*Evaluacion!O$30<>0,0),'Datos basicos'!$B$14)","v":0},{"$f":"MIN(D37+IF(Evaluacion!P$26<>0,'Premisas Beneficios'!$C$25*Evaluacion!P$26,0)+IF(Evaluacion!P$27<>0,'Premisas Beneficios'!$C$26*Evaluacion!P$27,0)+IF(Evaluacion!P$28<>0,'Premisas Beneficios'!$C$27*Evaluacion!P$28,0)+IF(Evaluacion!P$29<>0,'Premisas Beneficios'!$C$28*Evaluacion!P$29<>0,0)+IF(Evaluacion!P$30<>0,'Premisas Beneficios'!$C$29*Evaluacion!P$30<>0,0),'Datos basicos'!$B$14)","v":0},{"$f":"MIN(E37+IF(Evaluacion!Q$26<>0,'Premisas Beneficios'!$C$25*Evaluacion!Q$26,0)+IF(Evaluacion!Q$27<>0,'Premisas Beneficios'!$C$26*Evaluacion!Q$27,0)+IF(Evaluacion!Q$28<>0,'Premisas Beneficios'!$C$27*Evaluacion!Q$28,0)+IF(Evaluacion!Q$29<>0,'Premisas Beneficios'!$C$28*Evaluacion!Q$29<>0,0)+IF(Evaluacion!Q$30<>0,'Premisas Beneficios'!$C$29*Evaluacion!Q$30<>0,0),'Datos basicos'!$B$14)","v":0},{"$f":"MIN(F37+IF(Evaluacion!R$26<>0,'Premisas Beneficios'!$C$25*Evaluacion!R$26,0)+IF(Evaluacion!R$27<>0,'Premisas Beneficios'!$C$26*Evaluacion!R$27,0)+IF(Evaluacion!R$28<>0,'Premisas Beneficios'!$C$27*Evaluacion!R$28,0)+IF(Evaluacion!R$29<>0,'Premisas Beneficios'!$C$28*Evaluacion!R$29<>0,0)+IF(Evaluacion!R$30<>0,'Premisas Beneficios'!$C$29*Evaluacion!R$30<>0,0),'Datos basicos'!$B$14)","v":0},{"$f":"MIN(G37+IF(Evaluacion!S$26<>0,'Premisas Beneficios'!$C$25*Evaluacion!S$26,0)+IF(Evaluacion!S$27<>0,'Premisas Beneficios'!$C$26*Evaluacion!S$27,0)+IF(Evaluacion!S$28<>0,'Premisas Beneficios'!$C$27*Evaluacion!S$28,0)+IF(Evaluacion!S$29<>0,'Premisas Beneficios'!$C$28*Evaluacion!S$29<>0,0)+IF(Evaluacion!S$30<>0,'Premisas Beneficios'!$C$29*Evaluacion!S$30<>0,0),'Datos basicos'!$B$14)","v":0},{"$f":"+H37","v":0},{"$f":"+I37","v":0},0,0,0,0,0,0,0,0,0,0,0,0,0,0]
[null,"Eficiencia Física PROYECTADO CALENDARIZADO",{"$f":"+C28","v":0},{"$f":"MIN(C38+IF(Evaluacion!O$40<>0,'Premisas Beneficios'!$C$39*Evaluacion!O$40,0)+IF(Evaluacion!O$41<>0,'Premisas Beneficios'!$C$40*Evaluacion!O$41,0)+IF(Evaluacion!O$42<>0,'Premisas Beneficios'!$C$41*Evaluacion!O$42<>0,0)+IF(Evaluacion!O$44<>0,'Premisas Beneficios'!$C$43*Evaluacion!O$44,0)+IF(Evaluacion!O$45<>0,'Premisas Beneficios'!$C$44*Evaluacion!O$45,0)+IF(Evaluacion!O$46<>0,'Premisas Beneficios'!$C$45*Evaluacion!O$46,0)+IF(Evaluacion!O$47<>0,'Premisas Beneficios'!$C$46*Evaluacion!O$47,0)+IF(Evaluacion!O$48<>0,'Premisas Beneficios'!$C$47*Evaluacion!O$48,0)+IF(Evaluacion!O$49<>0,'Premisas Beneficios'!$C$48*Evaluacion!O$49,0)+IF(Evaluacion!O$50<>0,'Premisas Beneficios'!$C$49*Evaluacion!O$50,0)+IF(Evaluacion!O$51<>0,'Premisas Beneficios'!$C$50*Evaluacion!O$51,0),'Datos basicos'!$B$16)","v":0},{"$f":"MIN(D38+IF(Evaluacion!P$40<>0,'Premisas Beneficios'!$C$39*Evaluacion!P$40,0)+IF(Evaluacion!P$41<>0,'Premisas Beneficios'!$C$40*Evaluacion!P$41,0)+IF(Evaluacion!P$42<>0,'Premisas Beneficios'!$C$41*Evaluacion!P$42<>0,0)+IF(Evaluacion!P$44<>0,'Premisas Beneficios'!$C$43*Evaluacion!P$44,0)+IF(Evaluacion!P$45<>0,'Premisas Beneficios'!$C$44*Evaluacion!P$45,0)+IF(Evaluacion!P$46<>0,'Premisas Beneficios'!$C$45*Evaluacion!P$46,0)+IF(Evaluacion!P$47<>0,'Premisas Beneficios'!$C$46*Evaluacion!P$47,0)+IF(Evaluacion!P$48<>0,'Premisas Beneficios'!$C$47*Evaluacion!P$48,0)+IF(Evaluacion!P$49<>0,'Premisas Beneficios'!$C$48*Evaluacion!P$49,0)+IF(Evaluacion!P$50<>0,'Premisas Beneficios'!$C$49*Evaluacion!P$50,0)+IF(Evaluacion!P$51<>0,'Premisas Beneficios'!$C$50*Evaluacion!P$51,0),'Datos basicos'!$B$16)","v":0},{"$f":"MIN(E38+IF(Evaluacion!Q$40<>0,'Premisas Beneficios'!$C$39*Evaluacion!Q$40,0)+IF(Evaluacion!Q$41<>0,'Premisas Beneficios'!$C$40*Evaluacion!Q$41,0)+IF(Evaluacion!Q$42<>0,'Premisas Beneficios'!$C$41*Evaluacion!Q$42<>0,0)+IF(Evaluacion!Q$44<>0,'Premisas Beneficios'!$C$43*Evaluacion!Q$44,0)+IF(Evaluacion!Q$45<>0,'Premisas Beneficios'!$C$44*Evaluacion!Q$45,0)+IF(Evaluacion!Q$46<>0,'Premisas Beneficios'!$C$45*Evaluacion!Q$46,0)+IF(Evaluacion!Q$47<>0,'Premisas Beneficios'!$C$46*Evaluacion!Q$47,0)+IF(Evaluacion!Q$48<>0,'Premisas Beneficios'!$C$47*Evaluacion!Q$48,0)+IF(Evaluacion!Q$49<>0,'Premisas Beneficios'!$C$48*Evaluacion!Q$49,0)+IF(Evaluacion!Q$50<>0,'Premisas Beneficios'!$C$49*Evaluacion!Q$50,0)+IF(Evaluacion!Q$51<>0,'Premisas Beneficios'!$C$50*Evaluacion!Q$51,0),'Datos basicos'!$B$16)","v":0},{"$f":"MIN(F38+IF(Evaluacion!R$40<>0,'Premisas Beneficios'!$C$39*Evaluacion!R$40,0)+IF(Evaluacion!R$41<>0,'Premisas Beneficios'!$C$40*Evaluacion!R$41,0)+IF(Evaluacion!R$42<>0,'Premisas Beneficios'!$C$41*Evaluacion!R$42<>0,0)+IF(Evaluacion!R$44<>0,'Premisas Beneficios'!$C$43*Evaluacion!R$44,0)+IF(Evaluacion!R$45<>0,'Premisas Beneficios'!$C$44*Evaluacion!R$45,0)+IF(Evaluacion!R$46<>0,'Premisas Beneficios'!$C$45*Evaluacion!R$46,0)+IF(Evaluacion!R$47<>0,'Premisas Beneficios'!$C$46*Evaluacion!R$47,0)+IF(Evaluacion!R$48<>0,'Premisas Beneficios'!$C$47*Evaluacion!R$48,0)+IF(Evaluacion!R$49<>0,'Premisas Beneficios'!$C$48*Evaluacion!R$49,0)+IF(Evaluacion!R$50<>0,'Premisas Beneficios'!$C$49*Evaluacion!R$50,0)+IF(Evaluacion!R$51<>0,'Premisas Beneficios'!$C$50*Evaluacion!R$51,0),'Datos basicos'!$B$16)","v":0},{"$f":"MIN(G38+IF(Evaluacion!S$40<>0,'Premisas Beneficios'!$C$39*Evaluacion!S$40,0)+IF(Evaluacion!S$41<>0,'Premisas Beneficios'!$C$40*Evaluacion!S$41,0)+IF(Evaluacion!S$42<>0,'Premisas Beneficios'!$C$41*Evaluacion!S$42<>0,0)+IF(Evaluacion!S$44<>0,'Premisas Beneficios'!$C$43*Evaluacion!S$44,0)+IF(Evaluacion!S$45<>0,'Premisas Beneficios'!$C$44*Evaluacion!S$45,0)+IF(Evaluacion!S$46<>0,'Premisas Beneficios'!$C$45*Evaluacion!S$46,0)+IF(Evaluacion!S$47<>0,'Premisas Beneficios'!$C$46*Evaluacion!S$47,0)+IF(Evaluacion!S$48<>0,'Premisas Beneficios'!$C$47*Evaluacion!S$48,0)+IF(Evaluacion!S$49<>0,'Premisas Beneficios'!$C$48*Evaluacion!S$49,0)+IF(Evaluacion!S$50<>0,'Premisas Beneficios'!$C$49*Evaluacion!S$50,0)+IF(Evaluacion!S$51<>0,'Premisas Beneficios'!$C$50*Evaluacion!S$51,0),'Datos basicos'!$B$16)","v":0},{"$f":"+H38","v":0},{"$f":"+I38","v":0},0,0,0,0,0,0,0,0,0,0,0,0,0,0]
[null,"Facturación PROYECTADO CALENDARIZADO (m3)",{"$f":"+C26","v":0},{"$f":"IFERROR(C39*D32/C32+$C39*IF(Evaluacion!O$12<>0,'Premisas Beneficios'!$E$11*Evaluacion!O$12,0)+$C39*IF(Evaluacion!O$25,'Premisas Beneficios'!$C$24*Evaluacion!O$25,0)+$C39*IF(Evaluacion!O$31,'Premisas Beneficios'!$C$30*Evaluacion!O$31,0)+$C39*IF(Evaluacion!O$32,'Premisas Beneficios'!$C$31*Evaluacion!O$32,0)+$C39*IF(Evaluacion!O$43,'Premisas Beneficios'!$C$42*Evaluacion!O$43,0),0)","v":0},{"$f":"IFERROR(D39*E32/D32+$C39*IF(Evaluacion!P$12<>0,'Premisas Beneficios'!$E$11*Evaluacion!P$12,0)+$C39*IF(Evaluacion!P$25,'Premisas Beneficios'!$C$24*Evaluacion!P$25,0)+$C39*IF(Evaluacion!P$31,'Premisas Beneficios'!$C$30*Evaluacion!P$31,0)+$C39*IF(Evaluacion!P$32,'Premisas Beneficios'!$C$31*Evaluacion!P$32,0)+$C39*IF(Evaluacion!P$43,'Premisas Beneficios'!$C$42*Evaluacion!P$43,0),0)","v":0},{"$f":"IFERROR(E39*F32/E32+$C39*IF(Evaluacion!Q$12<>0,'Premisas Beneficios'!$E$11*Evaluacion!Q$12,0)+$C39*IF(Evaluacion!Q$25,'Premisas Beneficios'!$C$24*Evaluacion!Q$25,0)+$C39*IF(Evaluacion!Q$31,'Premisas Beneficios'!$C$30*Evaluacion!Q$31,0)+$C39*IF(Evaluacion!Q$32,'Premisas Beneficios'!$C$31*Evaluacion!Q$32,0)+$C39*IF(Evaluacion!Q$43,'Premisas Beneficios'!$C$42*Evaluacion!Q$43,0),0)","v":0},{"$f":"IFERROR(F39*G32/F32+$C39*IF(Evaluacion!R$12<>0,'Premisas Beneficios'!$E$11*Evaluacion!R$12,0)+$C39*IF(Evaluacion!R$25,'Premisas Beneficios'!$C$24*Evaluacion!R$25,0)+$C39*IF(Evaluacion!R$31,'Premisas Beneficios'!$C$30*Evaluacion!R$31,0)+$C39*IF(Evaluacion!R$32,'Premisas Beneficios'!$C$31*Evaluacion!R$32,0)+$C39*IF(Evaluacion!R$43,'Premisas Beneficios'!$C$42*Evaluacion!R$43,0),0)","v":0},{"$f":"IFERROR(G39*H32/G32+$C39*IF(Evaluacion!S$12<>0,'Premisas Beneficios'!$E$11*Evaluacion!S$12,0)+$C39*IF(Evaluacion!S$25,'Premisas Beneficios'!$C$24*Evaluacion!S$25,0)+$C39*IF(Evaluacion!S$31,'Premisas Beneficios'!$C$30*Evaluacion!S$31,0)+$C39*IF(Evaluacion!S$32,'Premisas Beneficios'!$C$31*Evaluacion!S$32,0)+$C39*IF(Evaluacion!S$43,'Premisas Beneficios'!$C$42*Evaluacion!S$43,0),0)","v":0},{"$f":"IFERROR(H39*I32/H32,0)","v":0},{"$f":"IFERROR(I39*J32/I32,0)","v":0},0,0,0,0,0,0,0,0,0,0,0,0,0,0]
[null,"Facturación PROYECTADO CALENDARIZADO ($)",{"$f":"+C32*C31","v":0},0,0,0,0,0,0,{"$f":"+J32*J31","v":0},0,0,0,0,0,0,0,0,0,0,0,0,0,0]
[null,"Producción PROYECTADO CALENDARIZADO (m3)",{"$f":"IFERROR(C39/C38,0)","v":0},0,0,0,0,0,0,{"$f":"IFERROR(J39/J38,0)","v":0},0,0,0,0,0,0,0,0,0,0,0,0,0,0]
[null,"Costo de Personal PROYECTADO CALENDARIZADO ($)",{"$f":"+'Datos basicos'!B28*'Datos basicos'!B25","v":0},{"$f":"IFERROR(C42*D32/C32-IF(Evaluacion!O$19<>0,'Premisas Beneficios'!$C$18*Evaluacion!O$19*('Proyecciones Base'!$C$32/1000)*'Datos basicos'!$B$28,0)-IF(Evaluacion!O$20<>0,'Premisas Beneficios'!$C$19*Evaluacion!O$20*('Proyecciones Base'!$C$32/1000)*'Datos basicos'!$B$28,0)-IF(Evaluacion!O$21<>0,'Premisas Beneficios'!$C$20*Evaluacion!O$21*('Proyecciones Base'!$C$32/1000)*'Datos basicos'!$B$28,0)-IF(Evaluacion!O$13<>0,'Premisas Beneficios'!$E$13*Evaluacion!O$13*'Datos basicos'!$B$25*('Proyecciones Base'!$C$32/1000)*'Datos basicos'!$B$28,0),0)","v":0},{"$f":"IFERROR(D42*E32/D32-IF(Evaluacion!P$19<>0,'Premisas Beneficios'!$C$18*Evaluacion!P$19*('Proyecciones Base'!$C$32/1000)*'Datos basicos'!$B$28,0)-IF(Evaluacion!P$20<>0,'Premisas Beneficios'!$C$19*Evaluacion!P$20*('Proyecciones Base'!$C$32/1000)*'Datos basicos'!$B$28,0)-IF(Evaluacion!P$21<>0,'Premisas Beneficios'!$C$20*Evaluacion!P$21*('Proyecciones Base'!$C$32/1000)*'Datos basicos'!$B$28,0)-IF(Evaluacion!P$13<>0,'Premisas Beneficios'!$E$13*Evaluacion!P$13*'Datos basicos'!$B$25*('Proyecciones Base'!$C$32/1000)*'Datos basicos'!$B$28,0),0)","v":0},{"$f":"IFERROR(E42*F32/E32-IF(Evaluacion!Q$19<>0,'Premisas Beneficios'!$C$18*Evaluacion!Q$19*('Proyecciones Base'!$C$32/1000)*'Datos basicos'!$B$28,0)-IF(Evaluacion!Q$20<>0,'Premisas Beneficios'!$C$19*Evaluacion!Q$20*('Proyecciones Base'!$C$32/1000)*'Datos basicos'!$B$28,0)-IF(Evaluacion!Q$21<>0,'Premisas Beneficios'!$C$20*Evaluacion!Q$21*('Proyecciones Base'!$C$32/1000)*'Datos basicos'!$B$28,0)-IF(Evaluacion!Q$13<>0,'Premisas Beneficios'!$E$13*Evaluacion!Q$13*'Datos basicos'!$B$25*('Proyecciones Base'!$C$32/1000)*'Datos basicos'!$B$28,0),0)","v":0},{"$f":"IFERROR(F42*G32/F32-IF(Evaluacion!R$19<>0,'Premisas Beneficios'!$C$18*Evaluacion!R$19*('Proyecciones Base'!$C$32/1000)*'Datos basicos'!$B$28,0)-IF(Evaluacion!R$20<>0,'Premisas Beneficios'!$C$19*Evaluacion!R$20*('Proyecciones Base'!$C$32/1000)*'Datos basicos'!$B$28,0)-IF(Evaluacion!R$21<>0,'Premisas Beneficios'!$C$20*Evaluacion!R$21*('Proyecciones Base'!$C$32/1000)*'Datos basicos'!$B$28,0)-IF(Evaluacion!R$13<>0,'Premisas Beneficios'!$E$13*Evaluacion!R$13*'Datos basicos'!$B$25*('Proyecciones Base'!$C$32/1000)*'Datos basicos'!$B$28,0),0)","v":0},{"$f":"IFERROR(G42*H32/G32-IF(Evaluacion!S$19<>0,'Premisas Beneficios'!$C$18*Evaluacion!S$19*('Proyecciones Base'!$C$32/1000)*'Datos basicos'!$B$28,0)-IF(Evaluacion!S$20<>0,'Premisas Beneficios'!$C$19*Evaluacion!S$20*('Proyecciones Base'!$C$32/1000)*'Datos basicos'!$B$28,0)-IF(Evaluacion!S$21<>0,'Premisas Beneficios'!$C$20*Evaluacion!S$21*('Proyecciones Base'!$C$32/1000)*'Datos basicos'!$B$28,0)-IF(Evaluacion!S$13<>0,'Premisas Beneficios'!$E$13*Evaluacion!S$13*'Datos basicos'!$B$25*('Proyecciones Base'!$C$32/1000)*'Datos basicos'!$B$28,0),0)","v":0},{"$f":"IFERROR(H42*I32/H32,0)","v":0},{"$f":"IFERROR(I42*J32/I32,0)","v":0},0,0,0,0,0,0,0,0,0,0,0,0,0,0]

{"sheet":"Precios","index":35,"n_rows":105,"n_cols":5,"rows_kept":105,"cut":false,"hidden":true,"merged":[[6,2,6,4],[3,2,3,9],[4,2,4,9]]}
[]
[null,"Formato Evaluación 11. PRECIOS"]
[]
[null,"NOMBRE:",{"$f":"+'Acciones a Ejecutar'!B4","v":"X"}]
[null,"AÑO:",{"$f":"+'Acciones a Ejecutar'!B5","v":0}]
[]
[null,null,"Definidos"]
[null,"Variable","Tamaño","Menor","Mayor"]
[null,{"$f":"+'Premisas Inversiones'!B8","v":"Asesoría Cambio de tarifas Eléctrica"}]
[null,null,1,100000,500000]
[null,null,2,{"$f":"+D10*2","v":200000},{"$f":"+E10*3","v":1500000}]
[null,null,3,{"$f":"+D11*2","v":400000},{"$f":"+E11*3","v":4500000}]
[null,null,4,{"$f":"+D12*2","v":800000},{"$f":"+E12*3","v":13500000}]
[null,{"$f":"+'Premisas Inversiones'!B9","v":"Instalación o sustitución de equipos"}]
[null,null,1,150000,250000]
[null,null,2,{"$f":"+D15*2","v":300000},{"$f":"+E15*3","v":750000}]
[null,null,3,{"$f":"+D16*2","v":600000},{"$f":"+E16*3","v":2250000}]
[null,null,4,{"$f":"+D17","v":600000},{"$f":"+E17*2","v":4500000}]
[null,{"$f":"+'Premisas Inversiones'!B10","v":"Compra e instalación de bombas AP"}]
[null,null,1,500000,1500000]
[null,null,2,{"$f":"+D20*2","v":1000000},{"$f":"+E20*3","v":4500000}]
[null,null,3,{"$f":"+D21*2","v":2000000},{"$f":"+E21*3","v":13500000}]
[null,null,4,{"$f":"+D22","v":2000000},{"$f":"+E22*2","v":27000000}]
[null,{"$f":"+'Premisas Inversiones'!B11","v":"Construcción de tanques"}]
[null,null,1,2000000,5000000]
[null,null,2,{"$f":"+D25*2","v":4000000},{"$f":"+E25*3","v":15000000}]
[null,null,3,{"$f":"+D26*2","v":8000000},{"$f":"+E26*3","v":45000000}]
[null,null,4,{"$f":"+D27","v":8000000},{"$f":"+E27*2","v":90000000}]
[null,{"$f":"+'Premisas Inversiones'!B12","v":"Automatización Bombas"}]
[null,null,1,200000,500000]
[null,null,2,{"$f":"+D30*2","v":400000},{"$f":"+E30*3","v":1500000}]
[null,null,3,{"$f":"+D31*2","v":800000},{"$f":"+E31*3","v":4500000}]
[null,null,4,{"$f":"+D32","v":800000},{"$f":"+E32*2","v":9000000}]
[null,{"$f":"+'Premisas Inversiones'!B13","v":"Compra e instalación de bombas A.R."}]
[null,null,1,500000,1500000]
[null,null,2,{"$f":"+D35*2","v":1000000},{"$f":"+E35*3","v":4500000}]
[null,null,3,{"$f":"+D36*2","v":2000000},{"$f":"+E36*3","v":13500000}]
[null,null,4,{"$f":"+D37","v":2000000},{"$f":"+E37*1.5","v":20250000}]
[null,{"$f":"+'Premisas Inversiones'!B14","v":"Cambio de equipos PTAR"}]
[null,null,1,100000,1500000]
[null,null,2,{"$f":"+D40*2","v":200000},{"$f":"+E40*3","v":4500000}]
[null,null,3,{"$f":"+D41*2","v":400000},{"$f":"+E41*3","v":13500000}]
[null,null,4,{"$f":"+D42","v":400000},{"$f":"+E42*1.5","v":20250000}]
[null,{"$f":"+'Premisas Inversiones'!B15","v":"Estudio Eficiencia Energética"}]
[null,null,1,100000,500000]
[null,null,2,{"$f":"+D45*2","v":200000},1000000]
[null,null,3,400000,2000000]
[null,null,4,800000,4000000]
[null,"Cursos de Capacitación"]
[null,null,1,50000,100000]
[null,null,2,{"$f":"+D50*2","v":100000},{"$f":"+E50*3","v":300000}]
[null,null,3,{"$f":"+D51*2","v":200000},{"$f":"+E51*3","v":900000}]
[null,null,4,{"$f":"+D52","v":200000},{"$f":"+E52*1.5","v":1350000}]
[null,"Costo Manuales"]
[null,null,1,100000,500000]
[null,null,2,{"$f":"+D55*2","v":200000},{"$f":"+E55*3","v":1500000}]
[null,null,3,{"$f":"+D56*2","v":400000},{"$f":"+E56*3","v":4500000}]
[null,null,4,{"$f":"+D57","v":400000},{"$f":"+E57*1.5","v":6750000}]
[null,"Estudio Consumo Cuota Fija"]
[null,null,1,100000,800000]
[null,null,2,{"$f":"+D60*2","v":200000},{"$f":"+E60*2","v":1600000}]
[null,null,3,{"$f":"+D61*2","v":400000},{"$f":"+E61*2","v":3200000}]
[null,null,4,{"$f":"+D62","v":400000},{"$f":"+E62","v":3200000}]
[null,"Capacitación Ef. Comercial"]
[null,null,1,50000,100000]
[null,null,2,{"$f":"+D65*2","v":100000},{"$f":"+E65*3","v":300000}]
[null,null,3,{"$f":"+D66*2","v":200000},{"$f":"+E66*3","v":900000}]
[null,null,4,{"$f":"+D67","v":200000},{"$f":"+E67*1.5","v":1350000}]
[null,"Capacitación Atención de usuarios"]
[null,null,1,{"$f":"+D65","v":50000},{"$f":"+E65","v":100000}]
[null,null,2,{"$f":"+D70*2","v":100000},{"$f":"+E70*2","v":200000}]
[null,null,3,{"$f":"+D71*2","v":200000},{"$f":"+E71*3","v":600000}]
[null,null,4,{"$f":"+D72","v":200000},{"$f":"+E72*1.5","v":900000}]
[null,"Asesoría convenios recaudadores"]
[null,null,1,50000,100000]
[null,null,2,{"$f":"+D75*2","v":100000},{"$f":"+E75*2","v":200000}]
[null,null,3,{"$f":"+D76*2","v":200000},{"$f":"+E76*2","v":400000}]
[null,null,4,{"$f":"+D77","v":200000},{"$f":"+E77*1.5","v":600000}]
[null,"Asesoría en esquema de cobranza"]
[null,null,1,50000,100000]
[null,null,2,{"$f":"+D80*2","v":100000},{"$f":"+E80*1.5","v":150000}]
[null,null,3,{"$f":"+D81*1.5","v":150000},{"$f":"+E81*1.5","v":225000}]
[null,null,4,{"$f":"+D82","v":150000},{"$f":"+E82*1.5","v":337500}]
[null,{"$f":"+'Premisas Inversiones'!B53","v":"Estudio Consejo ciudadanizado"}]
[null,null,1,100000,400000]
[null,null,2,{"$f":"+D85*2","v":200000},{"$f":"+E85*1.5","v":600000}]
[null,null,3,{"$f":"+D86*1.5","v":300000},{"$f":"+E86*1.5","v":900000}]
[null,null,4,{"$f":"+D87","v":300000},{"$f":"+E87*1.5","v":1350000}]
[null,{"$f":"+'Premisas Inversiones'!B54","v":"Estudio Código de ética"}]
[null,null,1,{"$f":"+D85","v":100000},{"$f":"+E85","v":400000}]
[null,null,2,{"$f":"+D90*2","v":200000},{"$f":"+E90*1.5","v":600000}]
[null,null,3,{"$f":"+D91*1.5","v":300000},{"$f":"+E91*1.5","v":900000}]
[null,null,4,{"$f":"+D92","v":300000},{"$f":"+E92*1.5","v":1350000}]
[null,{"$f":"+'Premisas Inversiones'!B56","v":"Asesoría sistema planeación"}]
[null,null,1,400000,600000]
[null,null,2,{"$f":"+D95*2","v":800000},{"$f":"+E95*2","v":1200000}]
[null,null,3,{"$f":"+D96*1.5","v":1200000},{"$f":"+E96*1.5","v":1800000}]
[null,null,4,{"$f":"+D97","v":1200000},{"$f":"+E97*1.5","v":2700000}]
[null,{"$f":"+'Premisas Inversiones'!B57","v":"Financiamiento contraparte"}]
[null,null,1,{"$f":"+D95","v":400000},{"$f":"+E95","v":600000}]
[null,null,2,{"$f":"+D100*2","v":800000},{"$f":"+E100*1.5","v":900000}]
[null,null,3,{"$f":"+D101*1.5","v":1200000},{"$f":"+E101*1.5","v":1350000}]
[null,null,4,{"$f":"+D102","v":1200000},{"$f":"+E102*1.5","v":2025000}]
[]
[null,"Nota: Todos los precios están en pesos."]